{"text_format":"1","workbook":"xlsx","n_sheets":3,"sheets":["開始前準備登録","あみだくじ","作業用"],"not_rendered":{"charts":0,"images":1,"macros":1,"external_links":0,"defined_names":0,"comments":0,"pivot_tables":0},"unopened":[],"bounds":{"document_bytes":16777216,"sheet_cells":100000,"rows_first":2000,"rows_last":500,"rows_between":2000,"halvings":0,"cell_chars":16384,"cell_head_chars":4096},"cells_cut":0,"cells_raw":0,"read":"whole","date_system":"1900"}

{"sheet":"開始前準備登録","index":0,"n_rows":34,"n_cols":13,"rows_kept":34,"cut":false,"hidden":false,"merged":[[0,10,0,12],[0,1,0,8],[2,1,3,1],[2,2,3,2],[2,7,3,7],[2,8,3,8],[2,3,3,3]]}
[null,"《あみだくじ開始前準備登録》",null,null,null,null,null,null,null,null,{"$f":"NOW()","v":"2022-05-20T15:11:38.290"}]
[null,{"$f":"\"開始前準備登録!$B$5:$B$\"&F4+4","v":"開始前準備登録!$B$5:$B$4"}]
[null,"参加者名簿","選択場所","選択chk",null,"参加者人数",null,"景品等","対象数",null,"はずれ人数",null,"くじ本数"]
[null,null,null,null,null,{"$f":"COUNTA(B5:B34)","v":0},null,null,null,null,{"$f":"IF(F4<SUM(I5:I34),0,F4-SUM(I5:I34))","v":0},null,{"$f":"IF(K4=0,SUM(I5:I34),F4)","v":0}]
[1,null,{"$f":"IFERROR(INDEX(あみだくじ!$3:$3,MATCH(B5,あみだくじ!$5:$5,0)),\"\")","v":""},{"$f":"COUNTIF(あみだくじ!$F$5:$GB$5,開始前準備登録!B5)","v":0},null,null,1]
[{"$f":"A5+1","v":2},null,{"$f":"IFERROR(INDEX(あみだくじ!$3:$3,MATCH(B6,あみだくじ!$5:$5,0)),\"\")","v":""},{"$f":"COUNTIF(あみだくじ!$F$5:$GB$5,開始前準備登録!B6)","v":0},null,null,{"$f":"G5+1","v":2}]
[{"$f":"A6+1","v":3},null,{"$f":"IFERROR(INDEX(あみだくじ!$3:$3,MATCH(B7,あみだくじ!$5:$5,0)),\"\")","v":""},{"$f":"COUNTIF(あみだくじ!$F$5:$GB$5,開始前準備登録!B7)","v":0},null,null,{"$f":"G6+1","v":3}]
[4,null,{"$f":"IFERROR(INDEX(あみだくじ!$3:$3,MATCH(B8,あみだくじ!$5:$5,0)),\"\")","v":""},{"$f":"COUNTIF(あみだくじ!$F$5:$GB$5,開始前準備登録!B8)","v":0},null,null,4]
[5,null,{"$f":"IFERROR(INDEX(あみだくじ!$3:$3,MATCH(B9,あみだくじ!$5:$5,0)),\"\")","v":""},{"$f":"COUNTIF(あみだくじ!$F$5:$GB$5,開始前準備登録!B9)","v":0},null,null,5]
[6,null,{"$f":"IFERROR(INDEX(あみだくじ!$3:$3,MATCH(B10,あみだくじ!$5:$5,0)),\"\")","v":""},{"$f":"COUNTIF(あみだくじ!$F$5:$GB$5,開始前準備登録!B10)","v":0},null,null,6]
[7,null,{"$f":"IFERROR(INDEX(あみだくじ!$3:$3,MATCH(B11,あみだくじ!$5:$5,0)),\"\")","v":""},{"$f":"COUNTIF(あみだくじ!$F$5:$GB$5,開始前準備登録!B11)","v":0},null,null,7]
[8,null,{"$f":"IFERROR(INDEX(あみだくじ!$3:$3,MATCH(B12,あみだくじ!$5:$5,0)),\"\")","v":""},{"$f":"COUNTIF(あみだくじ!$F$5:$GB$5,開始前準備登録!B12)","v":0},null,null,8]
[9,null,{"$f":"IFERROR(INDEX(あみだくじ!$3:$3,MATCH(B13,あみだくじ!$5:$5,0)),\"\")","v":""},{"$f":"COUNTIF(あみだくじ!$F$5:$GB$5,開始前準備登録!B13)","v":0},null,null,9]
[10,null,{"$f":"IFERROR(INDEX(あみだくじ!$3:$3,MATCH(B14,あみだくじ!$5:$5,0)),\"\")","v":""},{"$f":"COUNTIF(あみだくじ!$F$5:$GB$5,開始前準備登録!B14)","v":0},null,null,10]
[11,null,{"$f":"IFERROR(INDEX(あみだくじ!$3:$3,MATCH(B15,あみだくじ!$5:$5,0)),\"\")","v":""},{"$f":"COUNTIF(あみだくじ!$F$5:$GB$5,開始前準備登録!B15)","v":0},null,null,11]
{"$rows_left_out":20}
{"sheet":"あみだくじ","index":1,"n_rows":68,"n_cols":180,"rows_kept":68,"cut":false,"hidden":false,"merged":[[0,5,0,39],[67,5,74,9],[67,11,74,15],[67,17,74,21],[67,23,74,27],[67,29,74,33],[67,35,74,39],[59,5,66,9],[59,11,66,15],[59,17,66,21],[59,23,66,27],[59,29,66,33],[59,35,66,39],[4,5,11,9],[4,11,11,15],[4,17,11,21],[4,23,11,27],[4,29,11,33],[67,41,74,45],[67,47,74,51],[67,53,74,57],[67,59,74,63],[59,59,66,63],[59,77,66,81],[59,83,66,87],[59,89,66,93],[4,35,11,39],[4,65,11,69],[4,71,11,75],[4,41,11,45],[4,47,11,51],[4,53,11,57],[4,59,11,63],[59,95,66,99],[59,41,66,45],[59,47,66,51],[59,53,66,57],[59,101,66,105],[59,107,66,111],[4,77,11,81],[4,83,11,87],[4,89,11,93],[4,95,11,99],[4,101,11,105],[4,107,11,111],[67,113,74,117],[67,119,74,123],[2,5,3,9],[2,11,3,15],[2,17,3,21],[2,23,3,27],[2,29,3,33],[2,35,3,39],[2,41,3,45],[2,47,3,51],[59,113,66,117],[59,119,66,123],[67,65,74,69],[67,71,74,75],[67,77,74,81],[67,83,74,87],[67,89,74,93],[67,95,74,99],[67,101,74,105],[67,107,74,111],[4,113,11,117],[4,119,11,123],[59,65,66,69],[59,71,66,75],[2,89,3,93],[2,95,3,99],[2,101,3,105],[2,107,3,111],[2,113,3,117],[2,119,3,123],[2,53,3,57],[2,59,3,63],[2,65,3,69],[2,71,3,75],[2,77,3,81],[2,83,3,87],[2,179,3,183],[4,125,11,129],[4,131,11,135],[4,137,11,141],[4,143,11,147],[4,149,11,153],[4,155,11,159],[2,125,3,129],[2,131,3,135],[2,137,3,141],[2,143,3,147],[2,149,3,153],[2,155,3,159],[59,125,66,129],[59,131,66,135],[59,137,66,141],[59,143,66,147],[59,149,66,153],[59,155,66,159],[2,161,3,165],[2,167,3,171],[2,173,3,177],[67,161,74,165],[67,167,74,171],[67,173,74,177],[67,179,74,183],[1,5,1,9],[1,11,1,15],[1,17,1,21],[1,23,1,27],[1,29,1,33],[1,35,1,39],[59,161,66,165],[59,167,66,171],[59,173,66,177],[59,179,66,183],[67,125,74,129],[67,131,74,135],[67,137,74,141],[67,143,74,147],[67,149,74,153],[67,155,74,159],[4,161,11,165],[4,167,11,171],[4,173,11,177],[4,179,11,183],[1,173,1,177],[1,179,1,183],[1,113,1,117],[1,119,1,123],[1,125,1,129],[1,131,1,135],[1,137,1,141],[1,143,1,147],[1,77,1,81],[1,83,1,87],[1,89,1,93],[1,95,1,99],[1,101,1,105],[1,107,1,111],[1,41,1,45],[1,47,1,51],[1,53,1,57],[1,59,1,63],[0,47,0,63],[1,149,1,153],[1,155,1,159],[1,161,1,165],[1,167,1,171],[1,65,1,69],[1,71,1,75]]}
[null,null,null,null,null,"《あみだくじ台紙》",null,null,null,null,null,null,null,null,null,null,null,null,null,null,null,null,null,null,null,null,null,null,null,null,null,null,null,null,null,null,null,null,null,null,null,null,null,null,null,null,null,{"$f":"NOW()","v":"2022-05-20T15:11:38.290"}]
[null,null,null,null,null,{"$f":"IF(AND(F5<>\"\",作業用!F2>1),\"重複\",\"\")","v":""},null,null,null,null,null,{"$f":"IF(AND(L5<>\"\",作業用!L2>1),\"重複\",\"\")","v":""},null,null,null,null,null,{"$f":"IF(AND(R5<>\"\",作業用!R2>1),\"重複\",\"\")","v":""},null,null,null,null,null,{"$f":"IF(AND(X5<>\"\",作業用!X2>1),\"重複\",\"\")","v":""},null,null,null,null,null,{"$f":"IF(AND(AD5<>\"\",作業用!AD2>1),\"重複\",\"\")","v":""},null,null,null,null,null,{"$f":"IF(AND(AJ5<>\"\",作業用!AJ2>1),\"重複\",\"\")","v":""},null,null,null,null,null,{"$f":"IF(AND(AP5<>\"\",作業用!AP2>1),\"重複\",\"\")","v":""},null,null,null,null,null,{"$f":"IF(AND(AV5<>\"\",作業用!AV2>1),\"重複\",\"\")","v":""},null,null,null,null,null,{"$f":"IF(AND(BB5<>\"\",作業用!BB2>1),\"重複\",\"\")","v":""},null,null,null,null,null,{"$f":"IF(AND(BH5<>\"\",作業用!BH2>1),\"重複\",\"\")","v":""},null,null,null,null,null,{"$f":"IF(AND(BN5<>\"\",作業用!BN2>1),\"重複\",\"\")","v":""},null,null,null,null,null,{"$f":"IF(AND(BT5<>\"\",作業用!BT2>1),\"重複\",\"\")","v":""},null,null,null,null,null,{"$f":"IF(AND(BZ5<>\"\",作業用!BZ2>1),\"重複\",\"\")","v":""},null,null,null,null,null,{"$f":"IF(AND(CF5<>\"\",作業用!CF2>1),\"重複\",\"\")","v":""},null,null,null,null,null,{"$f":"IF(AND(CL5<>\"\",作業用!CL2>1),\"重複\",\"\")","v":""},null,null,null,null,null,{"$f":"IF(AND(CR5<>\"\",作業用!CR2>1),\"重複\",\"\")","v":""},null,null,null,null,null,{"$f":"IF(AND(CX5<>\"\",作業用!CX2>1),\"重複\",\"\")","v":""},null,null,null,null,null,{"$f":"IF(AND(DD5<>\"\",作業用!DD2>1),\"重複\",\"\")","v":""},null,null,null,null,null,{"$f":"IF(AND(DJ5<>\"\",作業用!DJ2>1),\"重複\",\"\")","v":""},null,null,null,null,null,{"$f":"IF(AND(DP5<>\"\",作業用!DP2>1),\"重複\",\"\")","v":""},null,null,null,null,null,{"$f":"IF(AND(DV5<>\"\",作業用!DV2>1),\"重複\",\"\")","v":""},null,null,null,null,null,{"$f":"IF(AND(EB5<>\"\",作業用!EB2>1),\"重複\",\"\")","v":""},null,null,null,null,null,{"$f":"IF(AND(EH5<>\"\",作業用!EH2>1),\"重複\",\"\")","v":""},null,null,null,null,null,{"$f":"IF(AND(EN5<>\"\",作業用!EN2>1),\"重複\",\"\")","v":""},null,null,null,null,null,{"$f":"IF(AND(ET5<>\"\",作業用!ET2>1),\"重複\",\"\")","v":""},null,null,null,null,null,{"$f":"IF(AND(EZ5<>\"\",作業用!EZ2>1),\"重複\",\"\")","v":""},null,null,null,null,null,{"$f":"IF(AND(FF5<>\"\",作業用!FF2>1),\"重複\",\"\")","v":""},null,null,null,null,null,{"$f":"IF(AND(FL5<>\"\",作業用!FL2>1),\"重複\",\"\")","v":""},null,null,null,null,null,{"$f":"IF(AND(FR5<>\"\",作業用!FR2>1),\"重複\",\"\")","v":""},null,null,null,null,null,{"$f":"IF(AND(FX5<>\"\",作業用!FX2>1),\"重複\",\"\")","v":""}]
[null,null,null,null,null,"①",null,null,null,null,null,"②",null,null,null,null,null,"③",null,null,null,null,null,"④",null,null,null,null,null,"⑤",null,null,null,null,null,"⑥",null,null,null,null,null,"⑦",null,null,null,null,null,"⑧",null,null,null,null,null,"⑨",null,null,null,null,null,"⑩",null,null,null,null,null,"⑪",null,null,null,null,null,"⑫",null,null,null,null,null,"⑬",null,null,null,null,null,"⑭",null,null,null,null,null,"⑮",null,null,null,null,null,"⑯",null,null,null,null,null,"⑰",null,null,null,null,null,"⑱",null,null,null,null,null,"⑲",null,null,null,null,null,"⑳",null,null,null,null,null,"㉑",null,null,null,null,null,"㉒",null,null,null,null,null,"㉓",null,null,null,null,null,"㉔",null,null,null,null,null,"㉕",null,null,null,null,null,"㉖",null,null,null,null,null,"㉗",null,null,null,null,null,"㉘",null,null,null,null,null,"㉙",null,null,null,null,null,"㉚"]
[]
[]
[]
[]
[]
[]
[]
[]
[]
[]
[]
[]
{"$rows_left_out":54}
{"sheet":"作業用","index":2,"n_rows":60,"n_cols":182,"rows_kept":60,"cut":false,"hidden":true,"merged":[[3,53,3,57],[2,59,2,63],[3,59,3,63],[59,3,66,3],[4,5,11,9],[4,11,11,15],[4,17,11,21],[4,23,11,27],[4,29,11,33],[4,35,11,39],[4,41,11,45],[4,47,11,51],[59,17,66,21],[59,23,66,27],[59,29,66,33],[59,35,66,39],[4,77,11,81],[4,83,11,87],[4,89,11,93],[4,95,11,99],[4,101,11,105],[4,107,11,111],[4,113,11,117],[2,5,2,9],[3,5,3,9],[2,11,2,15],[3,11,3,15],[2,17,2,21],[3,17,3,21],[2,23,2,27],[3,23,3,27],[2,29,2,33],[3,29,3,33],[2,35,2,39],[3,35,3,39],[2,41,2,45],[3,41,3,45],[2,47,2,51],[3,47,3,51],[2,53,2,57],[67,5,74,9],[67,11,74,15],[67,17,74,21],[67,23,74,27],[67,29,74,33],[67,35,74,39],[67,41,74,45],[67,47,74,51],[59,77,66,81],[59,41,66,45],[59,47,66,51],[59,53,66,57],[59,59,66,63],[59,65,66,69],[59,71,66,75],[59,5,66,9],[59,11,66,15],[2,101,2,105],[3,101,3,105],[2,137,2,141],[3,137,3,141],[2,143,2,147],[3,143,3,147],[67,53,74,57],[67,59,74,63],[67,65,74,69],[67,71,74,75],[67,77,74,81],[67,83,74,87],[59,113,66,117],[59,119,66,123],[59,83,66,87],[59,89,66,93],[59,95,66,99],[59,101,66,105],[59,107,66,111],[4,119,11,123],[4,53,11,57],[4,59,11,63],[4,65,11,69],[4,71,11,75],[2,107,2,111],[3,107,3,111],[2,113,2,117],[3,113,3,117],[2,119,2,123],[3,119,3,123],[2,125,2,129],[3,125,3,129],[2,131,2,135],[3,131,3,135],[67,179,74,183],[1,11,1,12],[1,5,1,6],[1,17,1,18],[1,23,1,24],[59,161,66,165],[59,167,66,171],[59,173,66,177],[59,179,66,183],[67,125,74,129],[67,131,74,135],[67,137,74,141],[67,143,74,147],[67,149,74,153],[67,155,74,159],[4,161,11,165],[4,167,11,171],[4,173,11,177],[4,179,11,183],[59,125,66,129],[59,131,66,135],[1,65,1,66],[59,149,66,153],[59,155,66,159],[1,59,1,60],[1,61,1,62],[1,67,1,68],[1,73,1,74],[1,79,1,80],[1,85,1,86],[1,91,1,92],[67,167,74,171],[67,173,74,177],[4,125,11,129],[4,131,11,135],[4,137,11,141],[4,143,11,147],[4,149,11,153],[4,155,11,159],[67,161,74,165],[67,89,74,93],[67,95,74,99],[67,101,74,105],[67,107,74,111],[67,113,74,117],[67,119,74,123],[59,137,66,141],[59,143,66,147],[1,151,1,152],[1,157,1,158],[1,163,1,164],[1,169,1,170],[1,175,1,176],[1,71,1,72],[1,77,1,78],[1,83,1,84],[1,89,1,90],[1,95,1,96],[2,65,2,69],[3,65,3,69],[2,71,2,75],[3,71,3,75],[2,77,2,81],[2,179,2,183],[3,179,3,183],[2,149,2,153],[3,149,3,153],[2,155,2,159],[3,155,3,159],[2,161,2,165],[3,161,3,165],[2,167,2,171],[3,167,3,171],[2,173,2,177],[3,173,3,177],[3,77,3,81],[2,83,2,87],[3,83,3,87],[2,89,2,93],[3,89,3,93],[2,95,2,99],[3,95,3,99],[1,7,1,8],[1,13,1,14],[1,19,1,20],[1,25,1,26],[1,31,1,32],[1,37,1,38],[1,43,1,44],[1,49,1,50],[1,55,1,56],[1,29,1,30],[1,35,1,36],[1,41,1,42],[1,47,1,48],[1,53,1,54],[1,181,1,182],[1,97,1,98],[1,103,1,104],[1,109,1,110],[1,115,1,116],[1,121,1,122],[1,127,1,128],[1,133,1,134],[1,139,1,140],[1,145,1,146],[1,173,1,174],[1,179,1,180],[1,137,1,138],[1,143,1,144],[1,149,1,150],[1,155,1,156],[1,161,1,162],[1,167,1,168],[1,101,1,102],[1,107,1,108],[1,113,1,114],[1,119,1,120],[1,125,1,126],[1,131,1,132]]}
[]
[null,null,"aaaa",null,null,{"$f":"IFERROR(VLOOKUP(F5,開始前準備登録!$B$4:$D$33,3,FALSE),\"\")","v":""},null,{"$f":"IF(F5=\"\",\"\",IF(INDEX($F$60:$GB$60,MATCH(F3&F5,$F$68:$GB$68,0))<>\"はずれ\",\"○\",\"\"))","v":""},null,null,null,{"$f":"IFERROR(VLOOKUP(L5,開始前準備登録!$B$4:$D$33,3,FALSE),\"\")","v":""},null,{"$f":"IF(L5=\"\",\"\",IF(INDEX($F$60:$GB$60,MATCH(L3&L5,$F$68:$GB$68,0))<>\"はずれ\",\"○\",\"\"))","v":""},null,null,null,{"$f":"IFERROR(VLOOKUP(R5,開始前準備登録!$B$4:$D$33,3,FALSE),\"\")","v":""},null,{"$f":"IF(R5=\"\",\"\",IF(INDEX($F$60:$GB$60,MATCH(R3&R5,$F$68:$GB$68,0))<>\"はずれ\",\"○\",\"\"))","v":""},null,null,null,{"$f":"IFERROR(VLOOKUP(X5,開始前準備登録!$B$4:$D$33,3,FALSE),\"\")","v":""},null,{"$f":"IF(X5=\"\",\"\",IF(INDEX($F$60:$GB$60,MATCH(X3&X5,$F$68:$GB$68,0))<>\"はずれ\",\"○\",\"\"))","v":""},null,null,null,{"$f":"IFERROR(VLOOKUP(AD5,開始前準備登録!$B$4:$D$33,3,FALSE),\"\")","v":""},null,{"$f":"IF(AD5=\"\",\"\",IF(INDEX($F$60:$GB$60,MATCH(AD3&AD5,$F$68:$GB$68,0))<>\"はずれ\",\"○\",\"\"))","v":""},null,null,null,{"$f":"IFERROR(VLOOKUP(AJ5,開始前準備登録!$B$4:$D$33,3,FALSE),\"\")","v":""},null,{"$f":"IF(AJ5=\"\",\"\",IF(INDEX($F$60:$GB$60,MATCH(AJ3&AJ5,$F$68:$GB$68,0))<>\"はずれ\",\"○\",\"\"))","v":""},null,null,null,{"$f":"IFERROR(VLOOKUP(AP5,開始前準備登録!$B$4:$D$33,3,FALSE),\"\")","v":""},null,{"$f":"IF(AP5=\"\",\"\",IF(INDEX($F$60:$GB$60,MATCH(AP3&AP5,$F$68:$GB$68,0))<>\"はずれ\",\"○\",\"\"))","v":""},null,null,null,{"$f":"IFERROR(VLOOKUP(AV5,開始前準備登録!$B$4:$D$33,3,FALSE),\"\")","v":""},null,{"$f":"IF(AV5=\"\",\"\",IF(INDEX($F$60:$GB$60,MATCH(AV3&AV5,$F$68:$GB$68,0))<>\"はずれ\",\"○\",\"\"))","v":""},null,null,null,{"$f":"IFERROR(VLOOKUP(BB5,開始前準備登録!$B$4:$D$33,3,FALSE),\"\")","v":""},null,{"$f":"IF(BB5=\"\",\"\",IF(INDEX($F$60:$GB$60,MATCH(BB3&BB5,$F$68:$GB$68,0))<>\"はずれ\",\"○\",\"\"))","v":""},null,null,null,{"$f":"IFERROR(VLOOKUP(BH5,開始前準備登録!$B$4:$D$33,3,FALSE),\"\")","v":""},null,{"$f":"IF(BH5=\"\",\"\",IF(INDEX($F$60:$GB$60,MATCH(BH3&BH5,$F$68:$GB$68,0))<>\"はずれ\",\"○\",\"\"))","v":""},null,null,null,{"$f":"IFERROR(VLOOKUP(BN5,開始前準備登録!$B$4:$D$33,3,FALSE),\"\")","v":""},null,{"$f":"IF(BN5=\"\",\"\",IF(INDEX($F$60:$GB$60,MATCH(BN3&BN5,$F$68:$GB$68,0))<>\"はずれ\",\"○\",\"\"))","v":""},null,null,null,{"$f":"IFERROR(VLOOKUP(BT5,開始前準備登録!$B$4:$D$33,3,FALSE),\"\")","v":""},null,{"$f":"IF(BT5=\"\",\"\",IF(INDEX($F$60:$GB$60,MATCH(BT3&BT5,$F$68:$GB$68,0))<>\"はずれ\",\"○\",\"\"))","v":""},null,null,null,{"$f":"IFERROR(VLOOKUP(BZ5,開始前準備登録!$B$4:$D$33,3,FALSE),\"\")","v":""},null,{"$f":"IF(BZ5=\"\",\"\",IF(INDEX($F$60:$GB$60,MATCH(BZ3&BZ5,$F$68:$GB$68,0))<>\"はずれ\",\"○\",\"\"))","v":""},null,null,null,{"$f":"IFERROR(VLOOKUP(CF5,開始前準備登録!$B$4:$D$33,3,FALSE),\"\")","v":""},null,{"$f":"IF(CF5=\"\",\"\",IF(INDEX($F$60:$GB$60,MATCH(CF3&CF5,$F$68:$GB$68,0))<>\"はずれ\",\"○\",\"\"))","v":""},null,null,null,{"$f":"IFERROR(VLOOKUP(CL5,開始前準備登録!$B$4:$D$33,3,FALSE),\"\")","v":""},null,{"$f":"IF(CL5=\"\",\"\",IF(INDEX($F$60:$GB$60,MATCH(CL3&CL5,$F$68:$GB$68,0))<>\"はずれ\",\"○\",\"\"))","v":""},null,null,null,{"$f":"IFERROR(VLOOKUP(CR5,開始前準備登録!$B$4:$D$33,3,FALSE),\"\")","v":""},null,{"$f":"IF(CR5=\"\",\"\",IF(INDEX($F$60:$GB$60,MATCH(CR3&CR5,$F$68:$GB$68,0))<>\"はずれ\",\"○\",\"\"))","v":""},null,null,null,{"$f":"IFERROR(VLOOKUP(CX5,開始前準備登録!$B$4:$D$33,3,FALSE),\"\")","v":""},null,{"$f":"IF(CX5=\"\",\"\",IF(INDEX($F$60:$GB$60,MATCH(CX3&CX5,$F$68:$GB$68,0))<>\"はずれ\",\"○\",\"\"))","v":""},null,null,null,{"$f":"IFERROR(VLOOKUP(DD5,開始前準備登録!$B$4:$D$33,3,FALSE),\"\")","v":""},null,{"$f":"IF(DD5=\"\",\"\",IF(INDEX($F$60:$GB$60,MATCH(DD3&DD5,$F$68:$GB$68,0))<>\"はずれ\",\"○\",\"\"))","v":""},null,null,null,{"$f":"IFERROR(VLOOKUP(DJ5,開始前準備登録!$B$4:$D$33,3,FALSE),\"\")","v":""},null,{"$f":"IF(DJ5=\"\",\"\",IF(INDEX($F$60:$GB$60,MATCH(DJ3&DJ5,$F$68:$GB$68,0))<>\"はずれ\",\"○\",\"\"))","v":""},null,null,null,{"$f":"IFERROR(VLOOKUP(DP5,開始前準備登録!$B$4:$D$33,3,FALSE),\"\")","v":""},null,{"$f":"IF(DP5=\"\",\"\",IF(INDEX($F$60:$GB$60,MATCH(DP3&DP5,$F$68:$GB$68,0))<>\"はずれ\",\"○\",\"\"))","v":""},null,null,null,{"$f":"IFERROR(VLOOKUP(DV5,開始前準備登録!$B$4:$D$33,3,FALSE),\"\")","v":""},null,{"$f":"IF(DV5=\"\",\"\",IF(INDEX($F$60:$GB$60,MATCH(DV3&DV5,$F$68:$GB$68,0))<>\"はずれ\",\"○\",\"\"))","v":""},null,null,null,{"$f":"IFERROR(VLOOKUP(EB5,開始前準備登録!$B$4:$D$33,3,FALSE),\"\")","v":""},null,{"$f":"IF(EB5=\"\",\"\",IF(INDEX($F$60:$GB$60,MATCH(EB3&EB5,$F$68:$GB$68,0))<>\"はずれ\",\"○\",\"\"))","v":""},null,null,null,{"$f":"IFERROR(VLOOKUP(EH5,開始前準備登録!$B$4:$D$33,3,FALSE),\"\")","v":""},null,{"$f":"IF(EH5=\"\",\"\",IF(INDEX($F$60:$GB$60,MATCH(EH3&EH5,$F$68:$GB$68,0))<>\"はずれ\",\"○\",\"\"))","v":""},null,null,null,{"$f":"IFERROR(VLOOKUP(EN5,開始前準備登録!$B$4:$D$33,3,FALSE),\"\")","v":""},null,{"$f":"IF(EN5=\"\",\"\",IF(INDEX($F$60:$GB$60,MATCH(EN3&EN5,$F$68:$GB$68,0))<>\"はずれ\",\"○\",\"\"))","v":""},null,null,null,{"$f":"IFERROR(VLOOKUP(ET5,開始前準備登録!$B$4:$D$33,3,FALSE),\"\")","v":""},null,{"$f":"IF(ET5=\"\",\"\",IF(INDEX($F$60:$GB$60,MATCH(ET3&ET5,$F$68:$GB$68,0))<>\"はずれ\",\"○\",\"\"))","v":""},null,null,null,{"$f":"IFERROR(VLOOKUP(EZ5,開始前準備登録!$B$4:$D$33,3,FALSE),\"\")","v":""},null,{"$f":"IF(EZ5=\"\",\"\",IF(INDEX($F$60:$GB$60,MATCH(EZ3&EZ5,$F$68:$GB$68,0))<>\"はずれ\",\"○\",\"\"))","v":""},null,null,null,{"$f":"IFERROR(VLOOKUP(FF5,開始前準備登録!$B$4:$D$33,3,FALSE),\"\")","v":""},null,{"$f":"IF(FF5=\"\",\"\",IF(INDEX($F$60:$GB$60,MATCH(FF3&FF5,$F$68:$GB$68,0))<>\"はずれ\",\"○\",\"\"))","v":""},null,null,null,{"$f":"IFERROR(VLOOKUP(FL5,開始前準備登録!$B$4:$D$33,3,FALSE),\"\")","v":""},null,{"$f":"IF(FL5=\"\",\"\",IF(INDEX($F$60:$GB$60,MATCH(FL3&FL5,$F$68:$GB$68,0))<>\"はずれ\",\"○\",\"\"))","v":""},null,null,null,{"$f":"IFERROR(VLOOKUP(FR5,開始前準備登録!$B$4:$D$33,3,FALSE),\"\")","v":""},null,{"$f":"IF(FR5=\"\",\"\",IF(INDEX($F$60:$GB$60,MATCH(FR3&FR5,$F$68:$GB$68,0))<>\"はずれ\",\"○\",\"\"))","v":""},null,null,null,{"$f":"IFERROR(VLOOKUP(FX5,開始前準備登録!$B$4:$D$33,3,FALSE),\"\")","v":""},null,{"$f":"IF(FX5=\"\",\"\",IF(INDEX($F$60:$GB$60,MATCH(FX3&FX5,$F$68:$GB$68,0))<>\"はずれ\",\"○\",\"\"))","v":""}]
[null,null,null,null,null,"①",null,null,null,null,null,"②",null,null,null,null,null,"③",null,null,null,null,null,"④",null,null,null,null,null,"⑤",null,null,null,null,null,"⑥",null,null,null,null,null,"⑦",null,null,null,null,null,"⑧",null,null,null,null,null,"⑨",null,null,null,null,null,"⑩",null,null,null,null,null,"⑪",null,null,null,null,null,"⑫",null,null,null,null,null,"⑬",null,null,null,null,null,"⑭",null,null,null,null,null,"⑮",null,null,null,null,null,"⑯",null,null,null,null,null,"⑰",null,null,null,null,null,"⑱",null,null,null,null,null,"⑲",null,null,null,null,null,"⑳",null,null,null,null,null,"㉑",null,null,null,null,null,"㉒",null,null,null,null,null,"㉓",null,null,null,null,null,"㉔",null,null,null,null,null,"㉕",null,null,null,null,null,"㉖",null,null,null,null,null,"㉗",null,null,null,null,null,"㉘",null,null,null,null,null,"㉙",null,null,null,null,null,"㉚"]
[null,"景品","順番","場所"]
[1,null,null,{"$f":"IFERROR(INDEX($F$3:$GB$3,(C5-1)*6+1),\"\")","v":""},null,{"$f":"あみだくじ!F5&\"\"","v":""},null,null,null,null,null,{"$f":"あみだくじ!L5&\"\"","v":""},null,null,null,null,null,{"$f":"あみだくじ!R5&\"\"","v":""},null,null,null,null,null,{"$f":"あみだくじ!X5&\"\"","v":""},null,null,null,null,null,{"$f":"あみだくじ!AD5&\"\"","v":""},null,null,null,null,null,{"$f":"あみだくじ!AJ5&\"\"","v":""},null,null,null,null,null,{"$f":"あみだくじ!AP5&\"\"","v":""},null,null,null,null,null,{"$f":"あみだくじ!AV5&\"\"","v":""},null,null,null,null,null,{"$f":"あみだくじ!BB5&\"\"","v":""},null,null,null,null,null,{"$f":"あみだくじ!BH5&\"\"","v":""},null,null,null,null,null,{"$f":"あみだくじ!BN5&\"\"","v":""},null,null,null,null,null,{"$f":"あみだくじ!BT5&\"\"","v":""},null,null,null,null,null,{"$f":"あみだくじ!BZ5&\"\"","v":""},null,null,null,null,null,{"$f":"あみだくじ!CF5&\"\"","v":""},null,null,null,null,null,{"$f":"あみだくじ!CL5&\"\"","v":""},null,null,null,null,null,{"$f":"あみだくじ!CR5&\"\"","v":""},null,null,null,null,null,{"$f":"あみだくじ!CX5&\"\"","v":""},null,null,null,null,null,{"$f":"あみだくじ!DD5&\"\"","v":""},null,null,null,null,null,{"$f":"あみだくじ!DJ5&\"\"","v":""},null,null,null,null,null,{"$f":"あみだくじ!DP5&\"\"","v":""},null,null,null,null,null,{"$f":"あみだくじ!DV5&\"\"","v":""},null,null,null,null,null,{"$f":"あみだくじ!EB5&\"\"","v":""},null,null,null,null,null,{"$f":"あみだくじ!EH5&\"\"","v":""},null,null,null,null,null,{"$f":"あみだくじ!EN5&\"\"","v":""},null,null,null,null,null,{"$f":"あみだくじ!ET5&\"\"","v":""},null,null,null,null,null,{"$f":"あみだくじ!EZ5&\"\"","v":""},null,null,null,null,null,{"$f":"あみだくじ!FF5&\"\"","v":""},null,null,null,null,null,{"$f":"あみだくじ!FL5&\"\"","v":""},null,null,null,null,null,{"$f":"あみだくじ!FR5&\"\"","v":""},null,null,null,null,null,{"$f":"あみだくじ!FX5&\"\"","v":""}]
[{"$f":"A5+1","v":2},null,null,{"$f":"IFERROR(INDEX($F$3:$GB$3,(C6-1)*6+1),\"\")","v":""}]
[{"$f":"A6+1","v":3},null,null,""]
[4,null,null,""]
[5,null,null,""]
[6,null,null,""]
[7,null,null,""]
[8,null,null,""]
[9,null,null,"",null,null,null,"@",null,null,null,null,null,"@",null,null,null,null,null,"@",null,null,null,null,null,"@",null,null,null,null,null,"@",null,null,null,null,null,"@",null,null,null,null,null,"@",null,null,null,null,null,"@",null,null,null,null,null,"@",null,null,null,null,null,"@",null,null,null,null,null,"@",null,null,null,null,null,"@",null,null,null,null,null,"@",null,null,null,null,null,"@",null,null,null,null,null,"@",null,null,null,null,null,"@",null,null,null,null,null,"@",null,null,null,null,null,"@",null,null,null,null,null,"@",null,null,null,null,null,"@",null,null,null,null,null,"@",null,null,null,null,null,"@",null,null,null,null,null,"@",null,null,null,null,null,"@",null,null,null,null,null,"@",null,null,null,null,null,"@",null,null,null,null,null,"@",null,null,null,null,null,"@",null,null,null,null,null,"@",null,null,null,null,null,"@"]
[10,null,null,"",null,null,null,"@",null,null,null,null,null,"@",null,null,null,null,null,"@",null,null,null,null,null,"@",null,null,null,null,null,"@",null,null,null,null,null,"@",null,null,null,null,null,"@",null,null,null,null,null,"@",null,null,null,null,null,"@",null,null,null,null,null,"@",null,null,null,null,null,"@",null,null,null,null,null,"@",null,null,null,null,null,"@",null,null,null,null,null,"@",null,null,null,null,null,"@",null,null,null,null,null,"@",null,null,null,null,null,"@",null,null,null,null,null,"@",null,null,null,null,null,"@",null,null,null,null,null,"@",null,null,null,null,null,"@",null,null,null,null,null,"@",null,null,null,null,null,"@",null,null,null,null,null,"@",null,null,null,null,null,"@",null,null,null,null,null,"@",null,null,null,null,null,"@",null,null,null,null,null,"@",null,null,null,null,null,"@",null,null,null,null,null,"@"]
[11,null,null,"",null,null,null,"@",null,null,null,null,null,"@",null,null,null,null,null,"@",null,null,null,null,null,"@",null,null,null,null,null,"@",null,null,null,null,null,"@",null,null,null,null,null,"@",null,null,null,null,null,"@",null,null,null,null,null,"@",null,null,null,null,null,"@",null,null,null,null,null,"@",null,null,null,null,null,"@",null,null,null,null,null,"@",null,null,null,null,null,"@",null,null,null,null,null,"@",null,null,null,null,null,"@",null,null,null,null,null,"@",null,null,null,null,null,"@",null,null,null,null,null,"@",null,null,null,null,null,"@",null,null,null,null,null,"@",null,null,null,null,null,"@",null,null,null,null,null,"@",null,null,null,null,null,"@",null,null,null,null,null,"@",null,null,null,null,null,"@",null,null,null,null,null,"@",null,null,null,null,null,"@",null,null,null,null,null,"@",null,null,null,null,null,"@"]
{"$rows_left_out":45}