{"text_format":"1","workbook":"xlsx","n_sheets":3,"sheets":["今月バイオリズム","3ヶ月バイオリズム","バイオリズム計算表"],"not_rendered":{"charts":2,"images":1,"macros":1,"external_links":0,"defined_names":0,"comments":0,"pivot_tables":0},"unopened":[],"bounds":{"document_bytes":16777216,"sheet_cells":100000,"rows_first":2000,"rows_last":500,"rows_between":2000,"halvings":0,"cell_chars":16384,"cell_head_chars":4096},"cells_cut":0,"cells_raw":0,"read":"whole","date_system":"1900"}

{"sheet":"今月バイオリズム","index":0,"n_rows":19,"n_cols":13,"rows_kept":19,"cut":false,"hidden":false,"merged":[[3,3,3,5],[2,3,2,5],[0,6,0,8],[14,10,14,12],[14,9,15,9],[6,9,6,13],[9,9,9,13],[12,9,12,13],[5,10,5,13],[8,10,8,13],[11,10,11,13],[0,11,0,13]]}
[null,null,null,null,null,null,"【TIT_バイオリズム】",null,null,null,null,{"$f":"TODAY()","v":"2021-02-18"}]
[]
[null,"あなたの生年月日",null,"開始日"]
[]
[null,null,null,null,null,null,null,null,null,"《開始日の状況》"]
[null,null,null,null,null,null,null,null,null,"身体(P)リズム",{"$f":"IFERROR(バイオリズム計算表!Y4&バイオリズム計算表!Z4,\"\")","v":""}]
[null,null,null,null,null,null,null,null,null,{"$f":"IFERROR(VLOOKUP(MID(K6,1,3),バイオリズム計算表!AJ2:AL4,2,FALSE)&\"　\"&VLOOKUP(MID(K6,1,3),バイオリズム計算表!AJ2:AL4,3,FALSE),\"\")","v":""}]
[]
[null,null,null,null,null,2021,2,18,null,"感情(S)リズム",{"$f":"IFERROR(バイオリズム計算表!AB4&バイオリズム計算表!AC4,\"\")","v":""}]
[null,null,null,null,null,null,null,null,null,{"$f":"IFERROR(VLOOKUP(MID(K9,1,3),バイオリズム計算表!AJ5:AL7,2,FALSE)&\"　\"&VLOOKUP(MID(K9,1,3),バイオリズム計算表!AJ5:AL7,3,FALSE),\"\")","v":""}]
[]
[null,null,null,null,null,null,null,null,null,"知性(I)リズム",{"$f":"IFERROR(バイオリズム計算表!AE4&バイオリズム計算表!AF4,\"\")","v":""}]
[null,null,null,null,null,null,null,null,null,{"$f":"IFERROR(VLOOKUP(MID(K12,1,3),バイオリズム計算表!AJ8:AL10,2,FALSE)&\"　\"&VLOOKUP(MID(K12,1,3),バイオリズム計算表!AJ8:AL10,3,FALSE),\"\")","v":""}]
[]
[null,null,null,null,null,null,null,null,null,null,"次回到来時期"]
[null,null,null,null,null,null,null,null,null,null,"要注意","高調期ピーク","低調期ピーク"]
[null,null,null,null,null,null,null,null,null,"身体(P)リズム",{"$f":"IF(ISERROR(VLOOKUP(K$16,バイオリズム計算表!$Y$4:$AG$34,9,FALSE))=TRUE,\"\",VLOOKUP(K$16,バイオリズム計算表!$Y$4:$AG$34,9,FALSE))","v":""},{"$f":"IF(ISERROR(VLOOKUP(L$16,バイオリズム計算表!$Y$4:$AG$34,9,FALSE))=TRUE,\"\",VLOOKUP(L$16,バイオリズム計算表!$Y$4:$AG$34,9,FALSE))","v":""},{"$f":"IF(ISERROR(VLOOKUP(M$16,バイオリズム計算表!$Y$4:$AG$34,9,FALSE))=TRUE,\"\",VLOOKUP(M$16,バイオリズム計算表!$Y$4:$AG$34,9,FALSE))","v":""}]
[null,null,null,null,null,null,null,null,null,"感情(S)リズム",{"$f":"IF(ISERROR(VLOOKUP(K$16,バイオリズム計算表!$AB$4:$AG$34,6,FALSE))=TRUE,\"\",VLOOKUP(K$16,バイオリズム計算表!$AB$4:$AG$34,6,FALSE))","v":""},{"$f":"IF(ISERROR(VLOOKUP(L$16,バイオリズム計算表!$AB$4:$AG$34,6,FALSE))=TRUE,\"\",VLOOKUP(L$16,バイオリズム計算表!$AB$4:$AG$34,6,FALSE))","v":""},{"$f":"IF(ISERROR(VLOOKUP(M$16,バイオリズム計算表!$AB$4:$AG$34,6,FALSE))=TRUE,\"\",VLOOKUP(M$16,バイオリズム計算表!$AB$4:$AG$34,6,FALSE))","v":""}]
[null,null,null,null,null,null,null,null,null,"知性(I)リズム",{"$f":"IF(ISERROR(VLOOKUP(K$16,バイオリズム計算表!$AE$4:$AG$34,3,FALSE))=TRUE,\"\",VLOOKUP(K$16,バイオリズム計算表!$AE$4:$AG$34,3,FALSE))","v":""},{"$f":"IF(ISERROR(VLOOKUP(L$16,バイオリズム計算表!$AE$4:$AG$34,3,FALSE))=TRUE,\"\",VLOOKUP(L$16,バイオリズム計算表!$AE$4:$AG$34,3,FALSE))","v":""},{"$f":"IF(ISERROR(VLOOKUP(M$16,バイオリズム計算表!$AE$4:$AG$34,3,FALSE))=TRUE,\"\",VLOOKUP(M$16,バイオリズム計算表!$AE$4:$AG$34,3,FALSE))","v":""}]

{"sheet":"3ヶ月バイオリズム","index":1,"n_rows":0,"n_cols":0,"rows_kept":0,"cut":false,"hidden":false,"merged":[]}

{"sheet":"バイオリズム計算表","index":2,"n_rows":368,"n_cols":38,"rows_kept":368,"cut":false,"hidden":true,"merged":[[7,34,9,34],[1,5,2,7],[1,8,2,10],[1,11,2,13],[1,14,2,17],[1,23,2,25],[1,26,2,28],[1,29,2,31],[1,34,3,34],[4,34,6,34]]}
[null,"１年間バイオリズム",null,null,null,null,null,null,null,null,null,null,null,null,null,null,null,null,null,"１ヶ月バイオリズム"]
[null,"サイクル日数",23,28,33,"身体リズム状況",null,null,"感情リズム状況",null,null,"知性リズム状況",null,null,"総合評価状況",null,null,null,null,"サイクル日数",23,28,33,"身体リズム状況",null,null,"感情リズム状況",null,null,"知性リズム状況",null,null,null,null,"身体","高調期","体力好調","仕事、旅行、スポーツ、強化訓練に適する。但し体力を過信した暴走に注意。回復力がある為、外科手術等に適す。"]
[null,"日付","身体(P)","感情(S)","知性(I)",null,null,null,null,null,null,null,null,null,null,null,null,null,null,"日付","身体(P)","感情(S)","知性(I)",null,null,null,null,null,null,null,null,null,null,null,null,"要注意","体調不安定 ","発熱 ・発作・カゼ・頭痛・病状の悪化・悪酔い・能力の低下が起きやすい。運転には要注意。"]
[{"$f":"B4","v":"1900-01-01"},{"$f":"DATE(YEAR(今月バイオリズム!D4),1,1)","v":"1900-01-01"},{"$f":"SIN(2*PI()*(MOD(($B4-今月バイオリズム!$B$4),C$2))/C$2)","v":0.26979677115702427},{"$f":"SIN(2*PI()*(MOD(($B4-今月バイオリズム!$B$4),D$2))/D$2)","v":0.22252093395631439},{"$f":"SIN(2*PI()*(MOD(($B4-今月バイオリズム!$B$4),E$2))/E$2)","v":0.18925124436041019},null,{"$f":"IF(C4>0,\"高調期（活動期）\",\"低調期（充電期）\")","v":"高調期（活動期）"},null,null,{"$f":"IF(D4>0,\"高調期（活動期）\",\"低調期（充電期）\")","v":"高調期（活動期）"},null,null,{"$f":"IF(E4>0,\"高調期（活動期）\",\"低調期（充電期）\")","v":"高調期（活動期）"},null,{"$f":"SUM(C4:E4)","v":0.68156894947374891},null,{"$f":"IF(O4>0,\"高調期（活動期）\",\"低調期（充電期）\")","v":"高調期（活動期）"},null,{"$f":"T4","v":{"$error":"#REF!"}},{"$f":"IF(今月バイオリズム!D4<>\"\",今月バイオリズム!D4,今月バイオリズム!#REF!)","v":{"$error":"#REF!"}},{"$f":"SIN(2*PI()*(MOD(($T4-今月バイオリズム!$B$4),U$2))/U$2)","v":{"$error":"#REF!"}},{"$f":"SIN(2*PI()*(MOD(($T4-今月バイオリズム!$B$4),V$2))/V$2)","v":{"$error":"#REF!"}},{"$f":"SIN(2*PI()*(MOD(($T4-今月バイオリズム!$B$4),W$2))/W$2)","v":{"$error":"#REF!"}},{"$f":"VLOOKUP($T4,$B$4:$O$368,5,FALSE)","v":{"$error":"#REF!"}},{"$f":"VLOOKUP($T4,$B$4:$O$368,6,FALSE)","v":{"$error":"#REF!"}},{"$f":"VLOOKUP($T4,$B$4:$O$368,7,FALSE)","v":{"$error":"#REF!"}},{"$f":"VLOOKUP($T4,$B$4:$O$368,8,FALSE)","v":{"$error":"#REF!"}},{"$f":"VLOOKUP($T4,$B$4:$O$368,9,FALSE)","v":{"$error":"#REF!"}},{"$f":"VLOOKUP($T4,$B$4:$O$368,10,FALSE)","v":{"$error":"#REF!"}},{"$f":"VLOOKUP($T4,$B$4:$O$368,11,FALSE)","v":{"$error":"#REF!"}},{"$f":"VLOOKUP($T4,$B$4:$O$368,12,FALSE)","v":{"$error":"#REF!"}},{"$f":"VLOOKUP($T4,$B$4:$O$368,13,FALSE)","v":{"$error":"#REF!"}},{"$f":"T4","v":{"$error":"#REF!"}},null,null,"低調期","体力低調","疲れやすく、過労の症状が出やすい時期。暴飲、暴食は慎み、体力の蓄積に努めること。"]
[{"$f":"B5","v":"1900-01-02"},{"$f":"B4+1","v":"1900-01-02"},{"$f":"SIN(2*PI()*(MOD(($B5-今月バイオリズム!$B$4),C$2))/C$2)","v":0.51958395003543356},{"$f":"SIN(2*PI()*(MOD(($B5-今月バイオリズム!$B$4),D$2))/D$2)","v":0.43388373911755812},{"$f":"SIN(2*PI()*(MOD(($B5-今月バイオリズム!$B$4),E$2))/E$2)","v":0.37166245566032752},{"$f":"IF(C5>0,IF(C4<C5,IF(C6<C5,\"▽\",\"↑\"),\"↓\"),IF(C4>C5,IF(C6>C5,\"▲\",\"↓\"),\"↑\"))","v":"↑"},{"$f":"IF(OR(AND(C4<=0,C5>=0),AND(C4>=0,C5<=0)),\"要注意\",IF(C5>0,IF(F5=\"▽\",\"高調期ピーク\",\"高調期（活動期）\"),IF(F5=\"▲\",\"低調期ピーク\",\"低調期（充電期）\")))","v":"高調期（活動期）"},{"$f":"IF(G5=\"要注意\",\"\",IF(F5=\"↑\",\"上昇中\",\"下降中\"))","v":"上昇中"},{"$f":"IF(D5>0,IF(D4<D5,IF(D6<D5,\"▽\",\"↑\"),\"↓\"),IF(D4>D5,IF(D6>D5,\"▲\",\"↓\"),\"↑\"))","v":"↑"},{"$f":"IF(OR(AND(D4<=0,D5>=0),AND(D4>=0,D5<=0)),\"要注意\",IF(D5>0,IF(I5=\"▽\",\"高調期ピーク\",\"高調期（活動期）\"),IF(I5=\"▲\",\"低調期ピーク\",\"低調期（充電期）\")))","v":"高調期（活動期）"},{"$f":"IF(J5=\"要注意\",\"\",IF(I5=\"↑\",\"上昇中\",\"下降中\"))","v":"上昇中"},{"$f":"IF(E5>0,IF(E4<E5,IF(E6<E5,\"▽\",\"↑\"),\"↓\"),IF(E4>E5,IF(E6>E5,\"▲\",\"↓\"),\"↑\"))","v":"↑"},{"$f":"IF(OR(AND(E4<=0,E5>=0),AND(E4>=0,E5<=0)),\"要注意\",IF(E5>0,IF(L5=\"▽\",\"高調期ピーク\",\"高調期（活動期）\"),IF(L5=\"▲\",\"低調期ピーク\",\"低調期（充電期）\")))","v":"高調期（活動期）"},{"$f":"IF(M5=\"要注意\",\"\",IF(L5=\"↑\",\"上昇中\",\"下降中\"))","v":"上昇中"},{"$f":"SUM(C5:E5)","v":1.3251301448133193},{"$f":"IF(O5>0,IF(O4<O5,IF(O6<O5,\"▽\",\"↑\"),\"↓\"),IF(O4>O5,IF(O6>O5,\"▲\",\"↓\"),\"↑\"))","v":"↑"},{"$f":"IF(OR(AND(O4<=0,O5>=0),AND(O4>=0,O5<=0)),\"要注意\",IF(O5>0,IF(P5=\"▽\",\"高調期ピーク\",\"高調期（活動期）\"),IF(P5=\"▲\",\"低調期ピーク\",\"低調期（充電期）\")))","v":"高調期（活動期）"},{"$f":"IF(Q5=\"要注意\",\"\",IF(P5=\"↑\",\"上昇中\",\"下降中\"))","v":"上昇中"},{"$f":"T5","v":{"$error":"#REF!"}},{"$f":"T4+1","v":{"$error":"#REF!"}},{"$f":"SIN(2*PI()*(MOD(($T5-今月バイオリズム!$B$4),U$2))/U$2)","v":{"$error":"#REF!"}},{"$f":"SIN(2*PI()*(MOD(($T5-今月バイオリズム!$B$4),V$2))/V$2)","v":{"$error":"#REF!"}},{"$f":"SIN(2*PI()*(MOD(($T5-今月バイオリズム!$B$4),W$2))/W$2)","v":{"$error":"#REF!"}},{"$f":"IF(U5>0,IF(U4<U5,IF(U6<U5,\"▽\",\"↑\"),\"↓\"),IF(U4>U5,IF(U6>U5,\"▲\",\"↓\"),\"↑\"))","v":{"$error":"#REF!"}},{"$f":"IF(OR(AND(U4<=0,U5>=0),AND(U4>=0,U5<=0)),\"要注意\",IF(U5>0,IF(X5=\"▽\",\"高調期ピーク\",\"高調期（活動期）\"),IF(X5=\"▲\",\"低調期ピーク\",\"低調期（充電期）\")))","v":{"$error":"#REF!"}},{"$f":"IF(Y5=\"要注意\",\"\",IF(X5=\"↑\",\"上昇中\",\"下降中\"))","v":{"$error":"#REF!"}},{"$f":"IF(V5>0,IF(V4<V5,IF(V6<V5,\"▽\",\"↑\"),\"↓\"),IF(V4>V5,IF(V6>V5,\"▲\",\"↓\"),\"↑\"))","v":{"$error":"#REF!"}},{"$f":"IF(OR(AND(V4<=0,V5>=0),AND(V4>=0,V5<=0)),\"要注意\",IF(V5>0,IF(AA5=\"▽\",\"高調期ピーク\",\"高調期（活動期）\"),IF(AA5=\"▲\",\"低調期ピーク\",\"低調期（充電期）\")))","v":{"$error":"#REF!"}},{"$f":"IF(AB5=\"要注意\",\"\",IF(AA5=\"↑\",\"上昇中\",\"下降中\"))","v":{"$error":"#REF!"}},{"$f":"IF(W5>0,IF(W4<W5,IF(W6<W5,\"▽\",\"↑\"),\"↓\"),IF(W4>W5,IF(W6>W5,\"▲\",\"↓\"),\"↑\"))","v":{"$error":"#REF!"}},{"$f":"IF(OR(AND(W4<=0,W5>=0),AND(W4>=0,W5<=0)),\"要注意\",IF(W5>0,IF(AD5=\"▽\",\"高調期ピーク\",\"高調期（活動期）\"),IF(AD5=\"▲\",\"低調期ピーク\",\"低調期（充電期）\")))","v":{"$error":"#REF!"}},{"$f":"IF(AE5=\"要注意\",\"\",IF(AD5=\"↑\",\"上昇中\",\"下降中\"))","v":{"$error":"#REF!"}},{"$f":"T5","v":{"$error":"#REF!"}},null,"感情","高調期","気力充実 ","気力に溢れ、積極的に仕事を片付けることが可能。共同作業、求愛、デートまた、麻雀やパチンコなどのギャンブルにも好調。"]
["1900-01-03",{"$f":"B5+1","v":"1900-01-03"},{"$f":"SIN(2*PI()*(MOD(($B6-今月バイオリズム!$B$4),C$2))/C$2)","v":0.73083596427812403},{"$f":"SIN(2*PI()*(MOD(($B6-今月バイオリズム!$B$4),D$2))/D$2)","v":0.62348980185873348},{"$f":"SIN(2*PI()*(MOD(($B6-今月バイオリズム!$B$4),E$2))/E$2)","v":0.54064081745559756},{"$f":"IF(C6>0,IF(C5<C6,IF(C7<C6,\"▽\",\"↑\"),\"↓\"),IF(C5>C6,IF(C7>C6,\"▲\",\"↓\"),\"↑\"))","v":"↑"},{"$f":"IF(OR(AND(C5<=0,C6>=0),AND(C5>=0,C6<=0)),\"要注意\",IF(C6>0,IF(F6=\"▽\",\"高調期ピーク\",\"高調期（活動期）\"),IF(F6=\"▲\",\"低調期ピーク\",\"低調期（充電期）\")))","v":"高調期（活動期）"},{"$f":"IF(G6=\"要注意\",\"\",IF(F6=\"↑\",\"上昇中\",\"下降中\"))","v":"上昇中"},"↑","高調期（活動期）",{"$f":"IF(J6=\"要注意\",\"\",IF(I6=\"↑\",\"上昇中\",\"下降中\"))","v":"上昇中"},"↑","高調期（活動期）",{"$f":"IF(M6=\"要注意\",\"\",IF(L6=\"↑\",\"上昇中\",\"下降中\"))","v":"上昇中"},1.894966583592455,"↑",{"$f":"IF(OR(AND(O5<=0,O6>=0),AND(O5>=0,O6<=0)),\"要注意\",IF(O6>0,IF(P6=\"▽\",\"高調期ピーク\",\"高調期（活動期）\"),IF(P6=\"▲\",\"低調期ピーク\",\"低調期（充電期）\")))","v":"高調期（活動期）"},{"$f":"IF(Q6=\"要注意\",\"\",IF(P6=\"↑\",\"上昇中\",\"下降中\"))","v":"上昇中"},{"$error":"#REF!"},{"$f":"T5+1","v":{"$error":"#REF!"}},{"$f":"SIN(2*PI()*(MOD(($T6-今月バイオリズム!$B$4),U$2))/U$2)","v":{"$error":"#REF!"}},{"$f":"SIN(2*PI()*(MOD(($T6-今月バイオリズム!$B$4),V$2))/V$2)","v":{"$error":"#REF!"}},{"$f":"SIN(2*PI()*(MOD(($T6-今月バイオリズム!$B$4),W$2))/W$2)","v":{"$error":"#REF!"}},{"$f":"IF(U6>0,IF(U5<U6,IF(U7<U6,\"▽\",\"↑\"),\"↓\"),IF(U5>U6,IF(U7>U6,\"▲\",\"↓\"),\"↑\"))","v":{"$error":"#REF!"}},{"$error":"#REF!"},{"$f":"IF(Y6=\"要注意\",\"\",IF(X6=\"↑\",\"上昇中\",\"下降中\"))","v":{"$error":"#REF!"}},{"$error":"#REF!"},{"$error":"#REF!"},{"$f":"IF(AB6=\"要注意\",\"\",IF(AA6=\"↑\",\"上昇中\",\"下降中\"))","v":{"$error":"#REF!"}},{"$error":"#REF!"},{"$error":"#REF!"},{"$f":"IF(AE6=\"要注意\",\"\",IF(AD6=\"↑\",\"上昇中\",\"下降中\"))","v":{"$error":"#REF!"}},{"$error":"#REF!"},null,null,"要注意","情緒不安定 ","感情や神経が動揺しやすい。立腹・失言・口論、病状悪化、反応低下あり。勝負事には向かない。運転にも注意。"]
["1900-01-04","1900-01-04",{"$f":"SIN(2*PI()*(MOD(($B7-今月バイオリズム!$B$4),C$2))/C$2)","v":0.88788521840237522},{"$f":"SIN(2*PI()*(MOD(($B7-今月バイオリズム!$B$4),D$2))/D$2)","v":0.7818314824680298},{"$f":"SIN(2*PI()*(MOD(($B7-今月バイオリズム!$B$4),E$2))/E$2)","v":0.69007901148211193},"↑","高調期（活動期）","上昇中","↑","高調期（活動期）","上昇中","↑","高調期（活動期）","上昇中",2.3597957123525171,"↑",{"$f":"IF(OR(AND(O6<=0,O7>=0),AND(O6>=0,O7<=0)),\"要注意\",IF(O7>0,IF(P7=\"▽\",\"高調期ピーク\",\"高調期（活動期）\"),IF(P7=\"▲\",\"低調期ピーク\",\"低調期（充電期）\")))","v":"高調期（活動期）"},"上昇中",{"$error":"#REF!"},{"$error":"#REF!"},{"$f":"SIN(2*PI()*(MOD(($T7-今月バイオリズム!$B$4),U$2))/U$2)","v":{"$error":"#REF!"}},{"$f":"SIN(2*PI()*(MOD(($T7-今月バイオリズム!$B$4),V$2))/V$2)","v":{"$error":"#REF!"}},{"$f":"SIN(2*PI()*(MOD(($T7-今月バイオリズム!$B$4),W$2))/W$2)","v":{"$error":"#REF!"}},{"$error":"#REF!"},{"$error":"#REF!"},{"$error":"#REF!"},{"$error":"#REF!"},{"$error":"#REF!"},{"$error":"#REF!"},{"$error":"#REF!"},{"$error":"#REF!"},{"$error":"#REF!"},{"$error":"#REF!"},null,null,"低調期","気力沈滞 ","すべての事柄に対して、消極的な気持になりがち。忍耐や神経を要する仕事は避けること。対人関係や勝負事も向かない。"]
["1900-01-05","1900-01-05",{"$f":"SIN(2*PI()*(MOD(($B8-今月バイオリズム!$B$4),C$2))/C$2)","v":0.97908408768232291},{"$f":"SIN(2*PI()*(MOD(($B8-今月バイオリズム!$B$4),D$2))/D$2)","v":0.90096886790241915},{"$f":"SIN(2*PI()*(MOD(($B8-今月バイオリズム!$B$4),E$2))/E$2)","v":0.81457595205033573},"↑","高調期（活動期）","上昇中","↑","高調期（活動期）","上昇中","↑","高調期（活動期）","上昇中",2.694628907635078,"↑","高調期（活動期）","上昇中",{"$error":"#REF!"},{"$error":"#REF!"},{"$f":"SIN(2*PI()*(MOD(($T8-今月バイオリズム!$B$4),U$2))/U$2)","v":{"$error":"#REF!"}},{"$f":"SIN(2*PI()*(MOD(($T8-今月バイオリズム!$B$4),V$2))/V$2)","v":{"$error":"#REF!"}},{"$f":"SIN(2*PI()*(MOD(($T8-今月バイオリズム!$B$4),W$2))/W$2)","v":{"$error":"#REF!"}},{"$error":"#REF!"},{"$error":"#REF!"},{"$error":"#REF!"},{"$error":"#REF!"},{"$error":"#REF!"},{"$error":"#REF!"},{"$error":"#REF!"},{"$error":"#REF!"},{"$error":"#REF!"},{"$error":"#REF!"},null,"知性","高調期","知力活動 ","頭の回転がよく、知的作業には最適。計画の立案や、検討・決定をしたり、不得意・難解な科目の勉強や暗記をするのに最適。"]
["1900-01-06","1900-01-06",{"$f":"SIN(2*PI()*(MOD(($B9-今月バイオリズム!$B$4),C$2))/C$2)","v":0.99766876919053915},{"$f":"SIN(2*PI()*(MOD(($B9-今月バイオリズム!$B$4),D$2))/D$2)","v":0.97492791218182362},{"$f":"SIN(2*PI()*(MOD(($B9-今月バイオリズム!$B$4),E$2))/E$2)","v":0.90963199535451833},"▽","高調期ピーク","下降中","↑","高調期（活動期）","上昇中","↑","高調期（活動期）","上昇中",2.8822286767268812,"↑","高調期（活動期）","上昇中",{"$error":"#REF!"},{"$error":"#REF!"},{"$f":"SIN(2*PI()*(MOD(($T9-今月バイオリズム!$B$4),U$2))/U$2)","v":{"$error":"#REF!"}},{"$f":"SIN(2*PI()*(MOD(($T9-今月バイオリズム!$B$4),V$2))/V$2)","v":{"$error":"#REF!"}},{"$f":"SIN(2*PI()*(MOD(($T9-今月バイオリズム!$B$4),W$2))/W$2)","v":{"$error":"#REF!"}},{"$error":"#REF!"},{"$error":"#REF!"},{"$error":"#REF!"},{"$error":"#REF!"},{"$error":"#REF!"},{"$error":"#REF!"},{"$error":"#REF!"},{"$error":"#REF!"},{"$error":"#REF!"},{"$error":"#REF!"},null,null,"要注意","知力不安定 ","注意力、集中力の欠如により、大小問わずにミスやポカを頻発しそう。重要な決定事項や契約のサインは避けること。運転注意。"]
["1900-01-07","1900-01-07",{"$f":"SIN(2*PI()*(MOD(($B10-今月バイオリズム!$B$4),C$2))/C$2)","v":0.94226092211882051},{"$f":"SIN(2*PI()*(MOD(($B10-今月バイオリズム!$B$4),D$2))/D$2)","v":1},{"$f":"SIN(2*PI()*(MOD(($B10-今月バイオリズム!$B$4),E$2))/E$2)","v":0.97181156832354165},"↓","高調期（活動期）","下降中","▽","高調期ピーク","下降中","↑","高調期（活動期）","上昇中",2.9140724904423623,"▽","高調期ピーク","下降中",{"$error":"#REF!"},{"$error":"#REF!"},{"$f":"SIN(2*PI()*(MOD(($T10-今月バイオリズム!$B$4),U$2))/U$2)","v":{"$error":"#REF!"}},{"$f":"SIN(2*PI()*(MOD(($T10-今月バイオリズム!$B$4),V$2))/V$2)","v":{"$error":"#REF!"}},{"$f":"SIN(2*PI()*(MOD(($T10-今月バイオリズム!$B$4),W$2))/W$2)","v":{"$error":"#REF!"}},{"$error":"#REF!"},{"$error":"#REF!"},{"$error":"#REF!"},{"$error":"#REF!"},{"$error":"#REF!"},{"$error":"#REF!"},{"$error":"#REF!"},{"$error":"#REF!"},{"$error":"#REF!"},{"$error":"#REF!"},null,null,"低調期","知的減衰 ","知的活動には不向き。頭を酷使せず、データ整理などの単純作業が良。"]
["1900-01-08","1900-01-08",{"$f":"SIN(2*PI()*(MOD(($B11-今月バイオリズム!$B$4),C$2))/C$2)","v":0.81696989301044209},{"$f":"SIN(2*PI()*(MOD(($B11-今月バイオリズム!$B$4),D$2))/D$2)","v":0.97492791218182362},{"$f":"SIN(2*PI()*(MOD(($B11-今月バイオリズム!$B$4),E$2))/E$2)","v":0.99886733918300796},{"$f":"IF(C11>0,IF(C10<C11,IF(C12<C11,\"▽\",\"↑\"),\"↓\"),IF(C10>C11,IF(C12>C11,\"▲\",\"↓\"),\"↑\"))","v":"↓"},"高調期（活動期）",{"$f":"IF(G11=\"要注意\",\"\",IF(F11=\"↑\",\"上昇中\",\"下降中\"))","v":"下降中"},"↓","高調期（活動期）","下降中","▽","高調期ピーク","下降中",2.7907651443752739,"↓","高調期（活動期）","下降中",{"$error":"#REF!"},{"$error":"#REF!"},{"$f":"SIN(2*PI()*(MOD(($T11-今月バイオリズム!$B$4),U$2))/U$2)","v":{"$error":"#REF!"}},{"$f":"SIN(2*PI()*(MOD(($T11-今月バイオリズム!$B$4),V$2))/V$2)","v":{"$error":"#REF!"}},{"$f":"SIN(2*PI()*(MOD(($T11-今月バイオリズム!$B$4),W$2))/W$2)","v":{"$error":"#REF!"}},{"$error":"#REF!"},{"$error":"#REF!"},{"$error":"#REF!"},{"$error":"#REF!"},{"$f":"IF(OR(AND(V10<=0,V11>=0),AND(V10>=0,V11<=0)),\"要注意\",IF(V11>0,IF(AA11=\"▽\",\"高調期ピーク\",\"高調期（活動期）\"),IF(AA11=\"▲\",\"低調期ピーク\",\"低調期（充電期）\")))","v":{"$error":"#REF!"}},{"$error":"#REF!"},{"$error":"#REF!"},{"$error":"#REF!"},{"$error":"#REF!"},{"$error":"#REF!"}]
["1900-01-09","1900-01-09",{"$f":"SIN(2*PI()*(MOD(($B12-今月バイオリズム!$B$4),C$2))/C$2)","v":0.63108794432605297},{"$f":"SIN(2*PI()*(MOD(($B12-今月バイオリズム!$B$4),D$2))/D$2)","v":0.90096886790241915},{"$f":"SIN(2*PI()*(MOD(($B12-今月バイオリズム!$B$4),E$2))/E$2)","v":0.9898214418809328},"↓","高調期（活動期）","下降中","↓","高調期（活動期）","下降中","↓","高調期（活動期）","下降中",2.5218782541094047,"↓","高調期（活動期）","下降中",{"$error":"#REF!"},{"$error":"#REF!"},{"$f":"SIN(2*PI()*(MOD(($T12-今月バイオリズム!$B$4),U$2))/U$2)","v":{"$error":"#REF!"}},{"$f":"SIN(2*PI()*(MOD(($T12-今月バイオリズム!$B$4),V$2))/V$2)","v":{"$error":"#REF!"}},{"$f":"SIN(2*PI()*(MOD(($T12-今月バイオリズム!$B$4),W$2))/W$2)","v":{"$error":"#REF!"}},{"$error":"#REF!"},{"$error":"#REF!"},{"$error":"#REF!"},{"$error":"#REF!"},{"$f":"IF(OR(AND(V11<=0,V12>=0),AND(V11>=0,V12<=0)),\"要注意\",IF(V12>0,IF(AA12=\"▽\",\"高調期ピーク\",\"高調期（活動期）\"),IF(AA12=\"▲\",\"低調期ピーク\",\"低調期（充電期）\")))","v":{"$error":"#REF!"}},{"$error":"#REF!"},{"$error":"#REF!"},{"$error":"#REF!"},{"$error":"#REF!"},{"$error":"#REF!"}]
["1900-01-10","1900-01-10",{"$f":"SIN(2*PI()*(MOD(($B13-今月バイオリズム!$B$4),C$2))/C$2)","v":0.3984010898462414},{"$f":"SIN(2*PI()*(MOD(($B13-今月バイオリズム!$B$4),D$2))/D$2)","v":0.78183148246802991},{"$f":"SIN(2*PI()*(MOD(($B13-今月バイオリズム!$B$4),E$2))/E$2)","v":0.94500081871466846},"↓","高調期（活動期）","下降中","↓","高調期（活動期）","下降中","↓","高調期（活動期）","下降中",2.1252333910289396,"↓","高調期（活動期）","下降中",{"$error":"#REF!"},{"$error":"#REF!"},{"$f":"SIN(2*PI()*(MOD(($T13-今月バイオリズム!$B$4),U$2))/U$2)","v":{"$error":"#REF!"}},{"$f":"SIN(2*PI()*(MOD(($T13-今月バイオリズム!$B$4),V$2))/V$2)","v":{"$error":"#REF!"}},{"$f":"SIN(2*PI()*(MOD(($T13-今月バイオリズム!$B$4),W$2))/W$2)","v":{"$error":"#REF!"}},{"$error":"#REF!"},{"$error":"#REF!"},{"$error":"#REF!"},{"$error":"#REF!"},{"$error":"#REF!"},{"$error":"#REF!"},{"$error":"#REF!"},{"$error":"#REF!"},{"$error":"#REF!"},{"$error":"#REF!"}]
["1900-01-11","1900-01-11",{"$f":"SIN(2*PI()*(MOD(($B14-今月バイオリズム!$B$4),C$2))/C$2)","v":0.13616664909624709},{"$f":"SIN(2*PI()*(MOD(($B14-今月バイオリズム!$B$4),D$2))/D$2)","v":0.62348980185873393},{"$f":"SIN(2*PI()*(MOD(($B14-今月バイオリズム!$B$4),E$2))/E$2)","v":0.86602540378443871},"↓","高調期（活動期）","下降中","↓","高調期（活動期）","下降中","↓","高調期（活動期）","下降中",1.6256818547394198,"↓","高調期（活動期）","下降中",{"$error":"#REF!"},{"$error":"#REF!"},{"$f":"SIN(2*PI()*(MOD(($T14-今月バイオリズム!$B$4),U$2))/U$2)","v":{"$error":"#REF!"}},{"$f":"SIN(2*PI()*(MOD(($T14-今月バイオリズム!$B$4),V$2))/V$2)","v":{"$error":"#REF!"}},{"$f":"SIN(2*PI()*(MOD(($T14-今月バイオリズム!$B$4),W$2))/W$2)","v":{"$error":"#REF!"}},{"$error":"#REF!"},{"$error":"#REF!"},{"$error":"#REF!"},{"$error":"#REF!"},{"$error":"#REF!"},{"$error":"#REF!"},{"$error":"#REF!"},{"$error":"#REF!"},{"$error":"#REF!"},{"$error":"#REF!"}]
["1900-01-12","1900-01-12",{"$f":"SIN(2*PI()*(MOD(($B15-今月バイオリズム!$B$4),C$2))/C$2)","v":-0.1361666490962464},{"$f":"SIN(2*PI()*(MOD(($B15-今月バイオリズム!$B$4),D$2))/D$2)","v":0.43388373911755823},{"$f":"SIN(2*PI()*(MOD(($B15-今月バイオリズム!$B$4),E$2))/E$2)","v":0.75574957435425827},"↓","要注意","","↓","高調期（活動期）","下降中","↓","高調期（活動期）","下降中",1.0534666643755701,"↓","高調期（活動期）","下降中",{"$error":"#REF!"},{"$error":"#REF!"},{"$f":"SIN(2*PI()*(MOD(($T15-今月バイオリズム!$B$4),U$2))/U$2)","v":{"$error":"#REF!"}},{"$f":"SIN(2*PI()*(MOD(($T15-今月バイオリズム!$B$4),V$2))/V$2)","v":{"$error":"#REF!"}},{"$f":"SIN(2*PI()*(MOD(($T15-今月バイオリズム!$B$4),W$2))/W$2)","v":{"$error":"#REF!"}},{"$error":"#REF!"},{"$error":"#REF!"},{"$error":"#REF!"},{"$error":"#REF!"},{"$error":"#REF!"},{"$error":"#REF!"},{"$error":"#REF!"},{"$error":"#REF!"},{"$error":"#REF!"},{"$error":"#REF!"}]
["1900-01-13","1900-01-13",{"$f":"SIN(2*PI()*(MOD(($B16-今月バイオリズム!$B$4),C$2))/C$2)","v":-0.39840108984624156},{"$f":"SIN(2*PI()*(MOD(($B16-今月バイオリズム!$B$4),D$2))/D$2)","v":0.22252093395631409},{"$f":"SIN(2*PI()*(MOD(($B16-今月バイオリズム!$B$4),E$2))/E$2)","v":0.61815898622060506},"↓","低調期（充電期）","下降中","↓","高調期（活動期）","下降中","↓","高調期（活動期）","下降中",0.44227883033067761,"↓","高調期（活動期）","下降中",{"$error":"#REF!"},{"$error":"#REF!"},{"$f":"SIN(2*PI()*(MOD(($T16-今月バイオリズム!$B$4),U$2))/U$2)","v":{"$error":"#REF!"}},{"$f":"SIN(2*PI()*(MOD(($T16-今月バイオリズム!$B$4),V$2))/V$2)","v":{"$error":"#REF!"}},{"$f":"SIN(2*PI()*(MOD(($T16-今月バイオリズム!$B$4),W$2))/W$2)","v":{"$error":"#REF!"}},{"$error":"#REF!"},{"$error":"#REF!"},{"$error":"#REF!"},{"$error":"#REF!"},{"$error":"#REF!"},{"$error":"#REF!"},{"$error":"#REF!"},{"$error":"#REF!"},{"$error":"#REF!"},{"$error":"#REF!"}]
["1900-01-14","1900-01-14",{"$f":"SIN(2*PI()*(MOD(($B17-今月バイオリズム!$B$4),C$2))/C$2)","v":-0.63108794432605275},{"$f":"SIN(2*PI()*(MOD(($B17-今月バイオリズム!$B$4),D$2))/D$2)","v":1.22514845490862E-16},{"$f":"SIN(2*PI()*(MOD(($B17-今月バイオリズム!$B$4),E$2))/E$2)","v":0.45822652172741052},"↓","低調期（充電期）","下降中","↓","高調期（活動期）","下降中","↓","高調期（活動期）","下降中",-0.17286142259864212,"↓","要注意","",{"$error":"#REF!"},{"$error":"#REF!"},{"$f":"SIN(2*PI()*(MOD(($T17-今月バイオリズム!$B$4),U$2))/U$2)","v":{"$error":"#REF!"}},{"$f":"SIN(2*PI()*(MOD(($T17-今月バイオリズム!$B$4),V$2))/V$2)","v":{"$error":"#REF!"}},{"$f":"SIN(2*PI()*(MOD(($T17-今月バイオリズム!$B$4),W$2))/W$2)","v":{"$error":"#REF!"}},{"$error":"#REF!"},{"$error":"#REF!"},{"$error":"#REF!"},{"$error":"#REF!"},{"$error":"#REF!"},{"$error":"#REF!"},{"$error":"#REF!"},{"$error":"#REF!"},{"$error":"#REF!"},{"$error":"#REF!"}]
["1900-01-15","1900-01-15",{"$f":"SIN(2*PI()*(MOD(($B18-今月バイオリズム!$B$4),C$2))/C$2)","v":-0.81696989301044198},{"$f":"SIN(2*PI()*(MOD(($B18-今月バイオリズム!$B$4),D$2))/D$2)","v":-0.22252093395631384},{"$f":"SIN(2*PI()*(MOD(($B18-今月バイオリズム!$B$4),E$2))/E$2)","v":0.28173255684143006},"↓","低調期（充電期）","下降中","↓","要注意","","↓","高調期（活動期）","下降中",-0.75775827012532571,"↓","低調期（充電期）","下降中",{"$error":"#REF!"},{"$error":"#REF!"},{"$f":"SIN(2*PI()*(MOD(($T18-今月バイオリズム!$B$4),U$2))/U$2)","v":{"$error":"#REF!"}},{"$f":"SIN(2*PI()*(MOD(($T18-今月バイオリズム!$B$4),V$2))/V$2)","v":{"$error":"#REF!"}},{"$f":"SIN(2*PI()*(MOD(($T18-今月バイオリズム!$B$4),W$2))/W$2)","v":{"$error":"#REF!"}},{"$error":"#REF!"},{"$error":"#REF!"},{"$error":"#REF!"},{"$error":"#REF!"},{"$error":"#REF!"},{"$error":"#REF!"},{"$error":"#REF!"},{"$error":"#REF!"},{"$error":"#REF!"},{"$error":"#REF!"}]
["1900-01-16","1900-01-16",{"$f":"SIN(2*PI()*(MOD(($B19-今月バイオリズム!$B$4),C$2))/C$2)","v":-0.9422609221188204},{"$f":"SIN(2*PI()*(MOD(($B19-今月バイオリズム!$B$4),D$2))/D$2)","v":-0.43388373911755801},{"$f":"SIN(2*PI()*(MOD(($B19-今月バイオリズム!$B$4),E$2))/E$2)","v":9.505604330418288E-2},"↓","低調期（充電期）","下降中","↓","低調期（充電期）","下降中","↓","高調期（活動期）","下降中",-1.2810886179321954,"↓","低調期（充電期）","下降中",{"$error":"#REF!"},{"$error":"#REF!"},{"$f":"SIN(2*PI()*(MOD(($T19-今月バイオリズム!$B$4),U$2))/U$2)","v":{"$error":"#REF!"}},{"$f":"SIN(2*PI()*(MOD(($T19-今月バイオリズム!$B$4),V$2))/V$2)","v":{"$error":"#REF!"}},{"$f":"SIN(2*PI()*(MOD(($T19-今月バイオリズム!$B$4),W$2))/W$2)","v":{"$error":"#REF!"}},{"$error":"#REF!"},{"$error":"#REF!"},{"$error":"#REF!"},{"$error":"#REF!"},{"$error":"#REF!"},{"$error":"#REF!"},{"$error":"#REF!"},{"$error":"#REF!"},{"$error":"#REF!"},{"$error":"#REF!"}]
["1900-01-17","1900-01-17",{"$f":"SIN(2*PI()*(MOD(($B20-今月バイオリズム!$B$4),C$2))/C$2)","v":-0.99766876919053926},{"$f":"SIN(2*PI()*(MOD(($B20-今月バイオリズム!$B$4),D$2))/D$2)","v":-0.62348980185873382},{"$f":"SIN(2*PI()*(MOD(($B20-今月バイオリズム!$B$4),E$2))/E$2)","v":-9.505604330418263E-2},"▲","低調期ピーク","下降中","↓","低調期（充電期）","下降中","↓","要注意","",-1.7162146143534558,"↓","低調期（充電期）","下降中",{"$error":"#REF!"},{"$error":"#REF!"},{"$f":"SIN(2*PI()*(MOD(($T20-今月バイオリズム!$B$4),U$2))/U$2)","v":{"$error":"#REF!"}},{"$f":"SIN(2*PI()*(MOD(($T20-今月バイオリズム!$B$4),V$2))/V$2)","v":{"$error":"#REF!"}},{"$f":"SIN(2*PI()*(MOD(($T20-今月バイオリズム!$B$4),W$2))/W$2)","v":{"$error":"#REF!"}},{"$error":"#REF!"},{"$error":"#REF!"},{"$error":"#REF!"},{"$error":"#REF!"},{"$error":"#REF!"},{"$error":"#REF!"},{"$error":"#REF!"},{"$error":"#REF!"},{"$error":"#REF!"},{"$error":"#REF!"}]
{"$rows_left_out":348}