{"text_format":"1","workbook":"xlsx","n_sheets":2,"sheets":["電卓","計算履歴"],"not_rendered":{"charts":0,"images":2,"macros":1,"external_links":0,"defined_names":1,"comments":0,"pivot_tables":0},"unopened":[],"bounds":{"document_bytes":16777216,"sheet_cells":100000,"rows_first":2000,"rows_last":500,"rows_between":2000,"halvings":0,"cell_chars":16384,"cell_head_chars":4096},"cells_cut":0,"cells_raw":0,"read":"whole","date_system":"1900"}

{"sheet":"電卓","index":0,"n_rows":28,"n_cols":59,"rows_kept":28,"cut":false,"hidden":false,"merged":[[23,58,23,63],[23,14,23,19],[19,17,19,22],[21,11,21,16],[16,11,16,16],[17,11,17,16],[18,11,18,16],[19,11,19,16],[16,17,16,22],[17,17,17,22],[18,17,18,22],[0,58,1,64],[20,17,20,22],[21,17,21,22],[6,11,6,16],[6,17,6,22],[20,11,20,16],[7,11,7,16],[8,11,8,16],[9,11,9,16],[10,11,10,16],[11,11,11,16],[12,11,12,16],[13,11,13,16],[14,11,14,16],[11,17,11,22],[15,11,15,16],[24,13,24,19],[12,17,12,22],[2,25,2,36],[0,14,1,19],[2,11,2,22],[7,17,7,22],[3,25,3,36],[0,21,1,21],[1,26,1,36],[14,17,14,22],[15,17,15,22],[8,17,8,22],[9,17,9,22],[10,17,10,22],[13,17,13,22],[5,10,5,22]]}
[null,null,null,null,null,null,null,null,null,null,null,null,null,null,"TIT_Excel電卓",null,null,null,null,null,null,{"$f":"IF(Y2=1,\"無効\",\"\")","v":""},null,null,null,null,null,null,null,null,null,null,null,null,null,null,null,null,null,null,null,null,null,null,null,null,null,null,null,null,null,null,null,null,null,null,null,null,{"$f":"TODAY()","v":"2021-02-25"}]
[]
[null,null,null,null,null,null,null,null,null,null,{"$f":"IF(Z2=\"＝\",Z2,\"\")","v":""},{"$f":"IF(AA2=\"\",\"\",AA2)","v":""},null,null,null,null,null,null,null,null,null,null,null,null,"桁数","実数",null,null,null,null,null,null,null,null,null,null,null,null,"前回\n入力","少数","種別"]
[null,null,null,null,null,null,null,null,null,null,{"$f":"IF(Z2=\"\",\"\",IF(Z2<>\"＝\",Z2,\"\"))","v":""},{"$f":"IF(Z24=\"\",\"\",Z24)","v":""},"","","","","","","","","","","",null,{"$f":"12-COUNTBLANK(L4:W4)","v":0},{"$f":"IF(W4=\"－\",0,IF(W4=\"\",0,VALUE(L4&M4&N4&O4&P4&Q4&R4&S4&T4&U4&V4&W4)))","v":0},null,null,null,null,null,null,null,null,null,null,null,null,null,{"$f":"COUNTIF(L4:W4,\".\")","v":0},{"$f":"IF(AM4=\"\",0,IF(OR(AM4=\".\",AM4=\"－\",AND(AM4>=0,AM4<=9)),1,2))","v":0}]
[]
[null,null,null,null,null,null,null,null,null,null,"履　　　歴",null,null,null,null,null,null,null,null,null,null,null,null,null,null,null,null,null,null,null,null,null,null,null,null,null,null,null,null,null,null,null,null,null,null,null,null,null,null,null,null,null,null,null,null,null,null,123]
[null,null,null,null,null,null,null,null,null,null,"演算子","入力内容",null,null,null,null,null,"計算結果",null,null,null,null,null,null,"桁",11,{"$f":"Z7-1","v":10},{"$f":"AA7-1","v":9},{"$f":"AB7-1","v":8},{"$f":"AC7-1","v":7},{"$f":"AD7-1","v":6},{"$f":"AE7-1","v":5},{"$f":"AF7-1","v":4},{"$f":"AG7-1","v":3},{"$f":"AH7-1","v":2},{"$f":"AI7-1","v":1},{"$f":"AJ7-1","v":0},null,"桁",11,{"$f":"AN7-1","v":10},{"$f":"AO7-1","v":9},8,7,6,5,4,3,2,1,0,null,null,null,null,null,{"$f":"IF(ISERROR(LEN(BF6)-FIND(\".\",BF6))=TRUE,0,LEN(BF6)-FIND(\".\",BF6))","v":0},{"$f":"IF(BE7>30,VLOOKUP(30,BE8:BF32,2,FALSE),VLOOKUP(BE7,BE8:BF32,2,FALSE))","v":"#,##0;[赤]-#,##0"}]
[null,null,null,null,null,null,null,null,null,{"$f":"IF(ISERROR(VLOOKUP(1,計算履歴!$A$4:$F$1003,3,FALSE))=TRUE,\"\",VLOOKUP(1,計算履歴!$A$4:$F$1003,3,FALSE))","v":""},{"$f":"IF($J8=\"\",\"\",IF(VLOOKUP($J8,計算履歴!$C$4:$F$1003,2,FALSE)=0,\"\",VLOOKUP($J8,計算履歴!$C$4:$F$1003,2,FALSE)))","v":""},{"$f":"IF($J8=\"\",\"\",IF(VLOOKUP($J8,計算履歴!$C$4:$F$1003,3,FALSE)=0,\"\",VLOOKUP($J8,計算履歴!$C$4:$F$1003,3,FALSE)))","v":""},null,null,null,null,null,{"$f":"IF($J8=\"\",\"\",IF(VLOOKUP($J8,計算履歴!$C$4:$F$1003,4,FALSE)=0,\"\",VLOOKUP($J8,計算履歴!$C$4:$F$1003,4,FALSE)))","v":""},null,null,null,null,null,null,{"$f":"LEN(L8)","v":0},{"$f":"IF(Z$7<$Y8,MID($L8,$Y8-Z$7,1),\"\")","v":""},"","","","","","","","","","","",null,null,{"$f":"IF($AM8>12,MID($R8,12-AN$7,1),IF(AN$7<$AM8,MID($R8,$AM8-AN$7,1),\"\"))","v":""},"","","","","","","","","","","",null,null,null,null,null,0,"#,##0;[赤]-#,##0"]
[null,null,null,null,null,null,null,null,null,{"$f":"IF(J8=\"\",\"\",IF(VLOOKUP(J8+1,計算履歴!$C$4:$D$1003,2,FALSE)=\"\",\"\",J8+1))","v":""},{"$f":"IF($J9=\"\",\"\",IF(VLOOKUP($J9,計算履歴!$C$4:$F$1003,2,FALSE)=0,\"\",VLOOKUP($J9,計算履歴!$C$4:$F$1003,2,FALSE)))","v":""},{"$f":"IF($J9=\"\",\"\",IF(VLOOKUP($J9,計算履歴!$C$4:$F$1003,3,FALSE)=0,\"\",VLOOKUP($J9,計算履歴!$C$4:$F$1003,3,FALSE)))","v":""},null,null,null,null,null,{"$f":"IF($J9=\"\",\"\",IF(VLOOKUP($J9,計算履歴!$C$4:$F$1003,4,FALSE)=0,\"\",VLOOKUP($J9,計算履歴!$C$4:$F$1003,4,FALSE)))","v":""},null,null,null,null,null,null,0,"","","","","","","","","","","","",null,null,"","","","","","","","","","","","",null,null,null,null,null,1,"#,##0.0;[赤]-#,##0.0"]
[null,null,null,null,null,null,null,null,null,{"$f":"IF(J9=\"\",\"\",IF(VLOOKUP(J9+1,計算履歴!$C$4:$D$1003,2,FALSE)=\"\",\"\",J9+1))","v":""},{"$f":"IF($J10=\"\",\"\",IF(VLOOKUP($J10,計算履歴!$C$4:$F$1003,2,FALSE)=0,\"\",VLOOKUP($J10,計算履歴!$C$4:$F$1003,2,FALSE)))","v":""},{"$f":"IF($J10=\"\",\"\",IF(VLOOKUP($J10,計算履歴!$C$4:$F$1003,3,FALSE)=0,\"\",VLOOKUP($J10,計算履歴!$C$4:$F$1003,3,FALSE)))","v":""},null,null,null,null,null,{"$f":"IF($J10=\"\",\"\",IF(VLOOKUP($J10,計算履歴!$C$4:$F$1003,4,FALSE)=0,\"\",VLOOKUP($J10,計算履歴!$C$4:$F$1003,4,FALSE)))","v":""},null,null,null,null,null,null,0,"","","","","","","","","","","","",null,null,"","","","","","","","","","","","",null,null,null,null,null,2,"#,##0.00;[赤]-#,##0.00"]
[null,null,null,null,null,null,null,null,null,{"$f":"IF(J10=\"\",\"\",IF(VLOOKUP(J10+1,計算履歴!$C$4:$D$1003,2,FALSE)=\"\",\"\",J10+1))","v":""},{"$f":"IF($J11=\"\",\"\",IF(VLOOKUP($J11,計算履歴!$C$4:$F$1003,2,FALSE)=0,\"\",VLOOKUP($J11,計算履歴!$C$4:$F$1003,2,FALSE)))","v":""},{"$f":"IF($J11=\"\",\"\",IF(VLOOKUP($J11,計算履歴!$C$4:$F$1003,3,FALSE)=0,\"\",VLOOKUP($J11,計算履歴!$C$4:$F$1003,3,FALSE)))","v":""},null,null,null,null,null,{"$f":"IF($J11=\"\",\"\",IF(VLOOKUP($J11,計算履歴!$C$4:$F$1003,4,FALSE)=0,\"\",VLOOKUP($J11,計算履歴!$C$4:$F$1003,4,FALSE)))","v":""},null,null,null,null,null,null,0,"","","","","","","","","","","","",null,null,"","","","","","","","","","","","",null,null,null,null,null,3,"#,##0.000;[赤]-#,##0.000"]
[null,null,null,null,null,null,null,null,null,{"$f":"IF(J11=\"\",\"\",IF(VLOOKUP(J11+1,計算履歴!$C$4:$D$1003,2,FALSE)=\"\",\"\",J11+1))","v":""},{"$f":"IF($J12=\"\",\"\",IF(VLOOKUP($J12,計算履歴!$C$4:$F$1003,2,FALSE)=0,\"\",VLOOKUP($J12,計算履歴!$C$4:$F$1003,2,FALSE)))","v":""},{"$f":"IF($J12=\"\",\"\",IF(VLOOKUP($J12,計算履歴!$C$4:$F$1003,3,FALSE)=0,\"\",VLOOKUP($J12,計算履歴!$C$4:$F$1003,3,FALSE)))","v":""},null,null,null,null,null,{"$f":"IF($J12=\"\",\"\",IF(VLOOKUP($J12,計算履歴!$C$4:$F$1003,4,FALSE)=0,\"\",VLOOKUP($J12,計算履歴!$C$4:$F$1003,4,FALSE)))","v":""},null,null,null,null,null,null,0,"","","","","","","","","","","","",null,null,"","","","","","","","","","","","",null,null,null,null,null,4,"#,##0.0000;[赤]-#,##0.0000"]
[null,null,null,null,null,null,null,null,null,{"$f":"IF(J12=\"\",\"\",IF(VLOOKUP(J12+1,計算履歴!$C$4:$D$1003,2,FALSE)=\"\",\"\",J12+1))","v":""},{"$f":"IF($J13=\"\",\"\",IF(VLOOKUP($J13,計算履歴!$C$4:$F$1003,2,FALSE)=0,\"\",VLOOKUP($J13,計算履歴!$C$4:$F$1003,2,FALSE)))","v":""},{"$f":"IF($J13=\"\",\"\",IF(VLOOKUP($J13,計算履歴!$C$4:$F$1003,3,FALSE)=0,\"\",VLOOKUP($J13,計算履歴!$C$4:$F$1003,3,FALSE)))","v":""},null,null,null,null,null,{"$f":"IF($J13=\"\",\"\",IF(VLOOKUP($J13,計算履歴!$C$4:$F$1003,4,FALSE)=0,\"\",VLOOKUP($J13,計算履歴!$C$4:$F$1003,4,FALSE)))","v":""},null,null,null,null,null,null,0,"","","","","","","","","","","","",null,null,"","","","","","","","","","","","",null,null,null,null,null,5,"#,##0.00000;[赤]-#,##0.00000"]
[null,null,null,null,null,null,null,null,null,{"$f":"IF(J13=\"\",\"\",IF(VLOOKUP(J13+1,計算履歴!$C$4:$D$1003,2,FALSE)=\"\",\"\",J13+1))","v":""},{"$f":"IF($J14=\"\",\"\",IF(VLOOKUP($J14,計算履歴!$C$4:$F$1003,2,FALSE)=0,\"\",VLOOKUP($J14,計算履歴!$C$4:$F$1003,2,FALSE)))","v":""},{"$f":"IF($J14=\"\",\"\",IF(VLOOKUP($J14,計算履歴!$C$4:$F$1003,3,FALSE)=0,\"\",VLOOKUP($J14,計算履歴!$C$4:$F$1003,3,FALSE)))","v":""},null,null,null,null,null,{"$f":"IF($J14=\"\",\"\",IF(VLOOKUP($J14,計算履歴!$C$4:$F$1003,4,FALSE)=0,\"\",VLOOKUP($J14,計算履歴!$C$4:$F$1003,4,FALSE)))","v":""},null,null,null,null,null,null,0,"","","","","","","","","","","","",null,null,"","","","","","","","","","","","",null,null,null,null,null,6,"#,##0.000000;[赤]-#,##0.000000"]
[null,null,null,null,null,null,null,null,null,{"$f":"IF(J14=\"\",\"\",IF(VLOOKUP(J14+1,計算履歴!$C$4:$D$1003,2,FALSE)=\"\",\"\",J14+1))","v":""},{"$f":"IF($J15=\"\",\"\",IF(VLOOKUP($J15,計算履歴!$C$4:$F$1003,2,FALSE)=0,\"\",VLOOKUP($J15,計算履歴!$C$4:$F$1003,2,FALSE)))","v":""},{"$f":"IF($J15=\"\",\"\",IF(VLOOKUP($J15,計算履歴!$C$4:$F$1003,3,FALSE)=0,\"\",VLOOKUP($J15,計算履歴!$C$4:$F$1003,3,FALSE)))","v":""},null,null,null,null,null,{"$f":"IF($J15=\"\",\"\",IF(VLOOKUP($J15,計算履歴!$C$4:$F$1003,4,FALSE)=0,\"\",VLOOKUP($J15,計算履歴!$C$4:$F$1003,4,FALSE)))","v":""},null,null,null,null,null,null,0,"","","","","","","","","","","","",null,null,"","","","","","","","","","","","",null,null,null,null,null,7,"#,##0.0000000;[赤]-#,##0.0000000"]
[null,null,null,null,null,null,null,null,null,{"$f":"IF(J15=\"\",\"\",IF(VLOOKUP(J15+1,計算履歴!$C$4:$D$1003,2,FALSE)=\"\",\"\",J15+1))","v":""},{"$f":"IF($J16=\"\",\"\",IF(VLOOKUP($J16,計算履歴!$C$4:$F$1003,2,FALSE)=0,\"\",VLOOKUP($J16,計算履歴!$C$4:$F$1003,2,FALSE)))","v":""},{"$f":"IF($J16=\"\",\"\",IF(VLOOKUP($J16,計算履歴!$C$4:$F$1003,3,FALSE)=0,\"\",VLOOKUP($J16,計算履歴!$C$4:$F$1003,3,FALSE)))","v":""},null,null,null,null,null,{"$f":"IF($J16=\"\",\"\",IF(VLOOKUP($J16,計算履歴!$C$4:$F$1003,4,FALSE)=0,\"\",VLOOKUP($J16,計算履歴!$C$4:$F$1003,4,FALSE)))","v":""},null,null,null,null,null,null,0,"","","","","","","","","","","","",null,null,"","","","","","","","","","","","",null,null,null,null,null,8,"#,##0.00000000;[赤]-#,##0.00000000"]
[null,null,null,null,null,null,null,null,null,{"$f":"IF(J16=\"\",\"\",IF(VLOOKUP(J16+1,計算履歴!$C$4:$D$1003,2,FALSE)=\"\",\"\",J16+1))","v":""},{"$f":"IF($J17=\"\",\"\",IF(VLOOKUP($J17,計算履歴!$C$4:$F$1003,2,FALSE)=0,\"\",VLOOKUP($J17,計算履歴!$C$4:$F$1003,2,FALSE)))","v":""},{"$f":"IF($J17=\"\",\"\",IF(VLOOKUP($J17,計算履歴!$C$4:$F$1003,3,FALSE)=0,\"\",VLOOKUP($J17,計算履歴!$C$4:$F$1003,3,FALSE)))","v":""},null,null,null,null,null,{"$f":"IF($J17=\"\",\"\",IF(VLOOKUP($J17,計算履歴!$C$4:$F$1003,4,FALSE)=0,\"\",VLOOKUP($J17,計算履歴!$C$4:$F$1003,4,FALSE)))","v":""},null,null,null,null,null,null,0,"","","","","","","","","","","","",null,null,"","","","","","","","","","","","",null,null,null,null,null,9,"#,##0.000000000;[赤]-#,##0.000000000"]
[null,null,null,null,null,null,null,null,null,{"$f":"IF(J17=\"\",\"\",IF(VLOOKUP(J17+1,計算履歴!$C$4:$D$1003,2,FALSE)=\"\",\"\",J17+1))","v":""},{"$f":"IF($J18=\"\",\"\",IF(VLOOKUP($J18,計算履歴!$C$4:$F$1003,2,FALSE)=0,\"\",VLOOKUP($J18,計算履歴!$C$4:$F$1003,2,FALSE)))","v":""},{"$f":"IF($J18=\"\",\"\",IF(VLOOKUP($J18,計算履歴!$C$4:$F$1003,3,FALSE)=0,\"\",VLOOKUP($J18,計算履歴!$C$4:$F$1003,3,FALSE)))","v":""},null,null,null,null,null,{"$f":"IF($J18=\"\",\"\",IF(VLOOKUP($J18,計算履歴!$C$4:$F$1003,4,FALSE)=0,\"\",VLOOKUP($J18,計算履歴!$C$4:$F$1003,4,FALSE)))","v":""},null,null,null,null,null,null,0,"","","","","","","","","","","","",null,null,"","","","","","","","","","","","",null,null,null,null,null,10,"#,##0.0000000000;[赤]-#,##0.0000000000"]
[null,null,null,null,null,null,null,null,null,{"$f":"IF(J18=\"\",\"\",IF(VLOOKUP(J18+1,計算履歴!$C$4:$D$1003,2,FALSE)=\"\",\"\",J18+1))","v":""},{"$f":"IF($J19=\"\",\"\",IF(VLOOKUP($J19,計算履歴!$C$4:$F$1003,2,FALSE)=0,\"\",VLOOKUP($J19,計算履歴!$C$4:$F$1003,2,FALSE)))","v":""},{"$f":"IF($J19=\"\",\"\",IF(VLOOKUP($J19,計算履歴!$C$4:$F$1003,3,FALSE)=0,\"\",VLOOKUP($J19,計算履歴!$C$4:$F$1003,3,FALSE)))","v":""},null,null,null,null,null,{"$f":"IF($J19=\"\",\"\",IF(VLOOKUP($J19,計算履歴!$C$4:$F$1003,4,FALSE)=0,\"\",VLOOKUP($J19,計算履歴!$C$4:$F$1003,4,FALSE)))","v":""},null,null,null,null,null,null,0,"","","","","","","","","","","","",null,null,"","","","","","","","","","","","",null,null,null,null,null,11,"#,##0.00000000000;[赤]-#,##0.00000000000"]
[null,null,null,null,null,null,null,null,null,{"$f":"IF(J19=\"\",\"\",IF(VLOOKUP(J19+1,計算履歴!$C$4:$D$1003,2,FALSE)=\"\",\"\",J19+1))","v":""},{"$f":"IF($J20=\"\",\"\",IF(VLOOKUP($J20,計算履歴!$C$4:$F$1003,2,FALSE)=0,\"\",VLOOKUP($J20,計算履歴!$C$4:$F$1003,2,FALSE)))","v":""},{"$f":"IF($J20=\"\",\"\",IF(VLOOKUP($J20,計算履歴!$C$4:$F$1003,3,FALSE)=0,\"\",VLOOKUP($J20,計算履歴!$C$4:$F$1003,3,FALSE)))","v":""},null,null,null,null,null,{"$f":"IF($J20=\"\",\"\",IF(VLOOKUP($J20,計算履歴!$C$4:$F$1003,4,FALSE)=0,\"\",VLOOKUP($J20,計算履歴!$C$4:$F$1003,4,FALSE)))","v":""},null,null,null,null,null,null,0,"","","","","","","","","","","","",null,null,"","","","","","","","","","","","",null,null,null,null,null,12,"#,##0.000000000000;[赤]-#,##0.000000000000"]
[null,null,null,null,null,null,null,null,null,{"$f":"IF(J20=\"\",\"\",IF(VLOOKUP(J20+1,計算履歴!$C$4:$D$1003,2,FALSE)=\"\",\"\",J20+1))","v":""},{"$f":"IF($J21=\"\",\"\",IF(VLOOKUP($J21,計算履歴!$C$4:$F$1003,2,FALSE)=0,\"\",VLOOKUP($J21,計算履歴!$C$4:$F$1003,2,FALSE)))","v":""},{"$f":"IF($J21=\"\",\"\",IF(VLOOKUP($J21,計算履歴!$C$4:$F$1003,3,FALSE)=0,\"\",VLOOKUP($J21,計算履歴!$C$4:$F$1003,3,FALSE)))","v":""},null,null,null,null,null,{"$f":"IF($J21=\"\",\"\",IF(VLOOKUP($J21,計算履歴!$C$4:$F$1003,4,FALSE)=0,\"\",VLOOKUP($J21,計算履歴!$C$4:$F$1003,4,FALSE)))","v":""},null,null,null,null,null,null,0,"","","","","","","","","","","","",null,null,"","","","","","","","","","","","",null,null,null,null,null,13,"#,##0.0000000000000;[赤]-#,##0.0000000000000"]
[null,null,null,null,null,null,null,null,null,{"$f":"IF(J21=\"\",\"\",IF(VLOOKUP(J21+1,計算履歴!$C$4:$D$1003,2,FALSE)=\"\",\"\",J21+1))","v":""},{"$f":"IF($J22=\"\",\"\",IF(VLOOKUP($J22,計算履歴!$C$4:$F$1003,2,FALSE)=0,\"\",VLOOKUP($J22,計算履歴!$C$4:$F$1003,2,FALSE)))","v":""},{"$f":"IF($J22=\"\",\"\",IF(VLOOKUP($J22,計算履歴!$C$4:$F$1003,3,FALSE)=0,\"\",VLOOKUP($J22,計算履歴!$C$4:$F$1003,3,FALSE)))","v":""},null,null,null,null,null,{"$f":"IF($J22=\"\",\"\",IF(VLOOKUP($J22,計算履歴!$C$4:$F$1003,4,FALSE)=0,\"\",VLOOKUP($J22,計算履歴!$C$4:$F$1003,4,FALSE)))","v":""},null,null,null,null,null,null,0,"","","","","","","","","","","","",null,null,"","","","","","","","","","","","",null,null,null,null,null,14,"#,##0.00000000000000;[赤]-#,##0.00000000000000"]
[null,null,null,null,null,null,null,null,null,null,null,null,null,null,null,null,null,null,null,null,null,null,null,null,null,null,null,null,null,null,null,null,null,null,null,null,null,null,null,null,null,null,null,null,null,null,null,null,null,null,null,null,null,null,null,null,15,"#,##0.000000000000000;[赤]-#,##0.000000000000000"]
[null,null,null,null,null,null,null,null,null,null,null,null,null,null,"株式会社つくばＩＴパートナー",null,null,null,null,null,null,null,null,null,null,null,null,null,null,null,null,null,null,null,null,null,null,null,null,null,null,null,null,null,null,null,null,null,null,null,null,null,null,null,null,null,16,"#,##0.0000000000000000;[赤]-#,##0.0000000000000000"]
[null,null,null,null,null,null,null,null,null,null,null,null,null,"Copyright © 2018 Tsukuba IT Partner Co., Ltd. All Rights Reserved.",null,null,null,null,null,null,null,null,null,null,null,null,null,null,null,null,null,null,null,null,null,null,null,null,null,null,null,null,null,null,null,null,null,null,null,null,null,null,null,null,null,null,17,"#,##0.00000000000000000;[赤]-#,##0.00000000000000000"]
[null,null,null,null,null,null,null,null,null,null,null,null,null,null,null,null,null,null,null,null,null,null,null,null,null,null,null,null,null,null,null,null,null,null,null,null,null,null,null,null,null,null,null,null,null,null,null,null,null,null,null,null,null,null,null,null,18,"#,##0.000000000000000000;[赤]-#,##0.000000000000000000"]
[null,null,null,null,null,null,null,null,null,null,null,null,null,null,null,null,null,null,null,null,null,null,null,null,null,null,null,null,null,null,null,null,null,null,null,null,null,null,null,null,null,null,null,null,null,null,null,null,null,null,null,null,null,null,null,null,19,"#,##0.0000000000000000000;[赤]-#,##0.0000000000000000000"]
[null,null,null,null,null,null,null,null,null,null,null,null,null,null,null,null,null,null,null,null,null,null,null,null,null,null,null,null,null,null,null,null,null,null,null,null,null,null,null,null,null,null,null,null,null,null,null,null,null,null,null,null,null,null,null,null,20,"#,##0.0000000000000000000;[赤]-#,##0.0000000000000000000"]

{"sheet":"計算履歴","index":1,"n_rows":1003,"n_cols":20,"rows_kept":1003,"cut":false,"hidden":false,"merged":[[1,1,2,1],[1,3,2,3],[1,4,1,5]]}
[null,null,null,null,"《計　算　履　歴》",{"$f":"TODAY()","v":"2021-02-25"}]
["開始№","対象","件数","演算子","履　　　歴"]
[{"$f":"IF(C3<=15,1,C3-13)","v":1},null,{"$f":"COUNTIF(B4:B1003,\"○\")","v":0},null,"入力","計算",null,"桁",11,{"$f":"I3-1","v":10},{"$f":"J3-1","v":9},8,7,6,5,4,3,2,1,0]
[{"$f":"IF(AND(D4=\"\",E4=\"\"),0,IF(AND(C4>=$A$3,C4<=$C$3),1,0))","v":0},{"$f":"IF(E4<>\"\",\"○\",\"\")","v":""},1,null,null,null,null,{"$f":"LEN(E4)","v":0},{"$f":"IF(I$3<$H4,MID($E4,$H4-I$3,1),\"\")","v":""},{"$f":"IF(J$3<$H4,MID($E4,$H4-J$3,1),\"\")","v":""},"","","","","","","","","",""]
[{"$f":"IF(AND(D5=\"\",E5=\"\"),0,IF(AND(C5>=$A$3,C5<=$C$3),A4+1,0))","v":0},{"$f":"IF(E5<>\"\",\"○\",\"\")","v":""},{"$f":"C4+1","v":2},null,null,null,null,{"$f":"LEN(E5)","v":0},{"$f":"IF(I$3<$H5,MID($E5,$H5-I$3,1),\"\")","v":""},"","","","","","","","","","",""]
[0,"",{"$f":"C5+1","v":3},null,null,null,null,0,"","","","","","","","","","","",""]
[0,"",4,null,null,null,null,0,"","","","","","","","","","","",""]
[0,"",5,null,null,null,null,0,"","","","","","","","","","","",""]
[0,"",6,null,null,null,null,0,"","","","","","","","","","","",""]
[0,"",7,null,null,null,null,0,"","","","","","","","","","","",""]
[0,"",8,null,null,null,null,0,"","","","","","","","","","","",""]
[0,"",9,null,null,null,null,0,"","","","","","","","","","","",""]
[0,"",10,null,null,null,null,0,"","","","","","","","","","","",""]
[0,"",11,null,null,null,null,0,"","","","","","","","","","","",""]
[0,"",12,null,null,null,null,0,"","","","","","","","","","","",""]
[0,"",13,null,null,null,null,0,"","","","","","","","","","","",""]
[0,"",14,null,null,null,null,0,"","","","","","","","","","","",""]
[0,"",{"$f":"C17+1","v":15},null,null,null,null,0,"","","","","","","","","","","",""]
[0,"",16,null,null,null,null,{"$f":"LEN(E19)","v":0},"","","","","","","","","","","",""]
[0,"",17,null,null,null,null,0,"","","","","","","","","","","",""]
[0,"",18,null,null,null,null,0,{"$f":"IF(I$3<$H21,MID($E21,$H21-I$3,1),\"\")","v":""},"","","","","","","","","","",""]
[0,"",19,null,null,null,null,0,"","","","","","","","","","","",""]
[0,"",20,null,null,null,null,0,"","","","","","","","","","","",""]
[0,"",21,null,null,null,null,0,"","","","","","","","","","","",""]
[0,"",22,null,null,null,null,0,"","","","","","","","","","","",""]
[0,"",23,null,null,null,null,0,"","","","","","","","","","","",""]
[0,"",24,null,null,null,null,0,"","","","","","","","","","","",""]
[0,"",25,null,null,null,null,0,"","","","","","","","","","","",""]
[0,"",26,null,null,null,null,0,"","","","","","","","","","","",""]
[0,"",27,null,null,null,null,0,"","","","","","","","","","","",""]
[0,"",28,null,null,null,null,0,"","","","","","","","","","","",""]
[0,"",29,null,null,null,null,0,"","","","","","","","","","","",""]
[0,"",30,null,null,null,null,0,"","","","","","","","","","","",""]
[0,"",31,null,null,null,null,0,"","","","","","","","","","","",""]
[0,"",32,null,null,null,null,0,"","","","","","","","","","","",""]
[0,"",33,null,null,null,null,0,"","","","","","","","","","","",""]
[0,"",34,null,null,null,null,0,"","","","","","","","","","","",""]
[0,"",35,null,null,null,null,0,"","","","","","","","","","","",""]
[0,"",36,null,null,null,null,0,"","","","","","","","","","","",""]
[0,"",37,null,null,null,null,0,"","","","","","","","","","","",""]
[0,"",38,null,null,null,null,0,"","","","","","","","","","","",""]
[0,"",39,null,null,null,null,0,"","","",{"$f":"IF(L$3<$H42,MID($E42,$H42-L$3,1),\"\")","v":""},"","","","","","","",""]
[0,"",40,null,null,null,null,0,{"$f":"IF(I$3<$H43,MID($E43,$H43-I$3,1),\"\")","v":""},"","","","","","","","","","",""]
[0,"",41,null,null,null,null,0,"","","","","","","","","","","",""]
[0,"",42,null,null,null,null,0,"","","","","","","","","","","",""]
[0,"",43,null,null,null,null,0,"","","","","","","","","","","",""]
[0,"",44,null,null,null,null,0,"","","","","","","","","","","",""]
[0,"",45,null,null,null,null,0,"","","","","","","","","","","",""]
[0,"",46,null,null,null,null,0,"","","","","","","","","","","",""]
[0,"",47,null,null,null,null,0,"","","","","","","","","","","",""]
[0,"",48,null,null,null,null,0,"","","","","","","","","","","",""]
[0,"",49,null,null,null,null,0,"","","","","","","","","","","",""]
[0,"",50,null,null,null,null,0,"","","","","","","","","","","",""]
[0,"",51,null,null,null,null,0,"","","","","","","","","","","",""]
[0,"",52,null,null,null,null,0,"","","","","","","","","","","",""]
[0,"",53,null,null,null,null,0,"","","","","","","","","","","",""]
[0,"",54,null,null,null,null,0,"","","","","","","","","","","",""]
[0,"",55,null,null,null,null,0,"","","","","","","","","","","",""]
[0,"",56,null,null,null,null,0,"","","","","","","","","","","",""]
[0,"",57,null,null,null,null,0,"","","","","","","","","","","",""]
[0,"",58,null,null,null,null,0,"","","","","","","","","","","",""]
[0,"",59,null,null,null,null,0,"","","","","","","","","","","",""]
[0,"",60,null,null,null,null,0,"","","","","","","","","","","",""]
[0,"",61,null,null,null,null,0,"","","","","","","","","","","",""]
[0,"",62,null,null,null,null,0,"","","","","",{"$f":"IF(N$3<$H65,MID($E65,$H65-N$3,1),\"\")","v":""},"","","","","",""]
[0,"",63,null,null,null,null,0,"","","","","","","","","","","",""]
[0,"",64,null,null,null,null,0,"","","","","","","","","","","",""]
[0,"",65,null,null,null,null,0,"","","","","","","","","","","",""]
[{"$f":"IF(AND(D69=\"\",E69=\"\"),0,IF(AND(C69>=$A$3,C69<=$C$3),A68+1,0))","v":0},{"$f":"IF(E69<>\"\",\"○\",\"\")","v":""},66,null,null,null,null,0,"","","","","","","","","","","",""]
[0,"",67,null,null,null,null,0,"","","","","","","","","","","",""]
[0,"",68,null,null,null,null,0,"","","","","","","","","","","",""]
[0,"",69,null,null,null,null,0,"","","","","","","","","","","",""]
[0,"",70,null,null,null,null,0,"","","","","","","","","","","",""]
[0,"",71,null,null,null,null,0,"","","","","","","","","","","",""]
[0,"",72,null,null,null,null,0,"","","","","","","","","","","",""]
[0,"",73,null,null,null,null,0,"","","","","","","","","","","",""]
[0,"",74,null,null,null,null,0,"","","","","","","","","","","",""]
[0,"",75,null,null,null,null,0,"","","","","","","","","","","",""]
[0,"",76,null,null,null,null,0,"","","","","","","","","","","",""]
[0,"",77,null,null,null,null,0,"","","","","","","","","","","",""]
[0,"",78,null,null,null,null,0,"","","","","","","","","","","",""]
[0,"",{"$f":"C81+1","v":79},null,null,null,null,0,"","","","","","","","","","","",""]
[0,"",80,null,null,null,null,{"$f":"LEN(E83)","v":0},"","","","","","","","","","","",""]
[0,"",81,null,null,null,null,0,"","","","","","","","","","","",""]
[0,"",82,null,null,null,null,0,"","","","","","","","","","","",""]
[0,"",83,null,null,null,null,0,"","","","","","","","","","","",""]
[0,"",84,null,null,null,null,0,"","","","","","","","","","","",""]
[0,"",85,null,null,null,null,0,"","","","","","","",{"$f":"IF(P$3<$H88,MID($E88,$H88-P$3,1),\"\")","v":""},"","","",""]
[0,"",86,null,null,null,null,0,"","","","","","","","","","","",""]
[0,"",87,null,null,null,null,0,"","","","","","","","","","","",""]
[0,"",88,null,null,null,null,0,"","","","","","","","","","","",""]
[0,"",89,null,null,null,null,0,"","","","","","","","","","","",""]
[0,"",90,null,null,null,null,0,"","","","","","","","","","","",""]
[0,"",91,null,null,null,null,0,"","","","","","","","","","","",""]
[0,"",92,null,null,null,null,0,"","","","","","","","","","","",""]
[0,"",93,null,null,null,null,0,"","","","","","","","","","","",""]
[0,"",94,null,null,null,null,0,"","","","","","","","","","","",""]
[0,"",95,null,null,null,null,0,"","","","","","","","","","","",""]
[0,"",96,null,null,null,null,0,"","","","","","","","","","","",""]
[0,"",97,null,null,null,null,0,"","","","","","","","","","","",""]
[0,"",98,null,null,null,null,0,"","","","","","","","","","","",""]
[0,"",99,null,null,null,null,0,"","","","","","","","","","","",""]
[0,"",100,null,null,null,null,0,"","","","","","","","","","","",""]
[0,"",101,null,null,null,null,0,"","","","","","","","","","","",""]
[0,"",102,null,null,null,null,0,"","","","","","","","","","","",""]
[0,"",103,null,null,null,null,0,"","","","","","","","","","","",""]
[0,"",104,null,null,null,null,0,{"$f":"IF(I$3<$H107,MID($E107,$H107-I$3,1),\"\")","v":""},"","","","","","","","","","",""]
[0,"",105,null,null,null,null,0,"","","","","","","","","","","",""]
[0,"",106,null,null,null,null,0,"","","","","","","","","","","",""]
[0,"",107,null,null,null,null,0,"","","","","","","","","","","",""]
[0,"",108,null,null,null,null,0,"","","","","","","","","",{"$f":"IF(R$3<$H111,MID($E111,$H111-R$3,1),\"\")","v":""},"",""]
[0,"",109,null,null,null,null,0,"","","","","","","","","","","",""]
[0,"",110,null,null,null,null,0,"","","","","","","","","","","",""]
[0,"",111,null,null,null,null,0,"","","","","","","","","","","",""]
[0,"",112,null,null,null,null,0,"","","","","","","","","","","",""]
[0,"",113,null,null,null,null,0,"","","","","","","","","","","",""]
[0,"",114,null,null,null,null,0,"","","","","","","","","","","",""]
[0,"",115,null,null,null,null,0,"","","","","","","","","","","",""]
[0,"",116,null,null,null,null,0,"","","","","","","","","","","",""]
[0,"",117,null,null,null,null,0,"","","","","","","","","","","",""]
{"$rows_left_out":883}