{"text_format":"1","workbook":"xlsx","n_sheets":6,"sheets":["花言葉検索","花言葉","誕生月花","誕生日花","国花","県花"],"not_rendered":{"charts":0,"images":1,"macros":1,"external_links":0,"defined_names":2,"comments":0,"pivot_tables":0},"unopened":[],"bounds":{"document_bytes":16777216,"sheet_cells":100000,"rows_first":2000,"rows_last":500,"rows_between":2000,"halvings":0,"cell_chars":16384,"cell_head_chars":4096},"cells_cut":0,"cells_raw":0,"read":"whole","date_system":"1900"}

{"sheet":"花言葉検索","index":0,"n_rows":9,"n_cols":8,"rows_kept":9,"cut":false,"hidden":false,"merged":[[0,6,0,7],[4,2,5,4],[6,2,6,4],[8,2,8,4],[4,7,5,7],[4,6,5,6],[3,2,3,7],[4,5,5,5],[0,3,1,4]]}
[null,null,null,"☘ 花 言 葉 ☘ 《検 索》",null,{"$f":"\"今月の誕生月花（\"&VLOOKUP(MONTH(G1),誕生月花!A:B,2,FALSE)&\"）\"","v":"今月の誕生月花（フリージア）"},{"$f":"TODAY()","v":"2021-02-19"}]
[null,null,null,null,null,{"$f":"\"本日の誕生日花（\"&VLOOKUP(DATE(2016,MONTH(G1),DAY(G1)),誕生日花!A:B,2,FALSE)&\"）\"","v":"本日の誕生日花（プリムラ）"}]
[]
[null,null,"検索入力（部分検索）（or条件）"]
[null,null,"花の名称",null,null,"花言葉","誕生月花\n対象月","誕生日花\n対象月日"]
[]
[]
[]
[null,null,"花名称",null,null,"花言葉","誕生月","誕生月日"]

{"sheet":"花言葉","index":1,"n_rows":1701,"n_cols":6,"rows_kept":1701,"cut":false,"hidden":true,"merged":[]}
["花の名前１","花の名前２","色／形態","花言葉","誕生月花","誕生日花"]
["藍","アイ","","あなた次第",{"$f":"IFERROR(MATCH(B2,誕生月花!$B$2:$B$13,0),\"\")","v":""},{"$f":"IFERROR(VLOOKUP(B2&C2,誕生日花!E:F,2,FALSE),IFERROR(VLOOKUP(B2,誕生日花!E:F,2,FALSE),\"\"))","v":""}]
["藍","アイ","","美しい装い",{"$f":"IFERROR(MATCH(B3,誕生月花!$B$2:$B$13,0),\"\")","v":""},{"$f":"IFERROR(VLOOKUP(B3&C3,誕生日花!E:F,2,FALSE),IFERROR(VLOOKUP(B3,誕生日花!E:F,2,FALSE),\"\"))","v":""}]
["西洋木蔦（セイヨウキズタ）","アイビー","","公正と信頼",{"$f":"IFERROR(MATCH(B4,誕生月花!$B$2:$B$13,0),\"\")","v":""},{"$f":"IFERROR(VLOOKUP(B4&C4,誕生日花!E:F,2,FALSE),IFERROR(VLOOKUP(B4,誕生日花!E:F,2,FALSE),\"\"))","v":""}]
["西洋木蔦（セイヨウキズタ）","アイビー","","永遠の愛",{"$f":"IFERROR(MATCH(B5,誕生月花!$B$2:$B$13,0),\"\")","v":""},{"$f":"IFERROR(VLOOKUP(B5&C5,誕生日花!E:F,2,FALSE),IFERROR(VLOOKUP(B5,誕生日花!E:F,2,FALSE),\"\"))","v":""}]
["西洋木蔦（セイヨウキズタ）","アイビー","","結婚",{"$f":"IFERROR(MATCH(B6,誕生月花!$B$2:$B$13,0),\"\")","v":""},{"$f":"IFERROR(VLOOKUP(B6&C6,誕生日花!E:F,2,FALSE),IFERROR(VLOOKUP(B6,誕生日花!E:F,2,FALSE),\"\"))","v":""}]
["西洋木蔦（セイヨウキズタ）","アイビー","","誠実",{"$f":"IFERROR(MATCH(B7,誕生月花!$B$2:$B$13,0),\"\")","v":""},{"$f":"IFERROR(VLOOKUP(B7&C7,誕生日花!E:F,2,FALSE),IFERROR(VLOOKUP(B7,誕生日花!E:F,2,FALSE),\"\"))","v":""}]
["西洋木蔦（セイヨウキズタ）","アイビー","","不滅",{"$f":"IFERROR(MATCH(B8,誕生月花!$B$2:$B$13,0),\"\")","v":""},{"$f":"IFERROR(VLOOKUP(B8&C8,誕生日花!E:F,2,FALSE),IFERROR(VLOOKUP(B8,誕生日花!E:F,2,FALSE),\"\"))","v":""}]
["西洋木蔦（セイヨウキズタ）","アイビー","","友情",{"$f":"IFERROR(MATCH(B9,誕生月花!$B$2:$B$13,0),\"\")","v":""},{"$f":"IFERROR(VLOOKUP(B9&C9,誕生日花!E:F,2,FALSE),IFERROR(VLOOKUP(B9,誕生日花!E:F,2,FALSE),\"\"))","v":""}]
["蔦葉天竺葵（ツタバテンジクアオイ）","アイビーゼラニウム","","新しいチャレンジ",{"$f":"IFERROR(MATCH(B10,誕生月花!$B$2:$B$13,0),\"\")","v":""},{"$f":"IFERROR(VLOOKUP(B10&C10,誕生日花!E:F,2,FALSE),IFERROR(VLOOKUP(B10,誕生日花!E:F,2,FALSE),\"\"))","v":""}]
["文目（アヤメ）","アイリス","","優雅",{"$f":"IFERROR(MATCH(B11,誕生月花!$B$2:$B$13,0),\"\")","v":""},{"$f":"IFERROR(VLOOKUP(B11&C11,誕生日花!E:F,2,FALSE),IFERROR(VLOOKUP(B11,誕生日花!E:F,2,FALSE),\"\"))","v":""}]
["葵","アオイ","","豊穣",{"$f":"IFERROR(MATCH(B12,誕生月花!$B$2:$B$13,0),\"\")","v":""},{"$f":"IFERROR(VLOOKUP(B12&C12,誕生日花!E:F,2,FALSE),IFERROR(VLOOKUP(B12,誕生日花!E:F,2,FALSE),\"\"))","v":""}]
["葵","アオイ","白","女性の野心",{"$f":"IFERROR(MATCH(B13,誕生月花!$B$2:$B$13,0),\"\")","v":""},{"$f":"IFERROR(VLOOKUP(B13&C13,誕生日花!E:F,2,FALSE),IFERROR(VLOOKUP(B13,誕生日花!E:F,2,FALSE),\"\"))","v":""}]
["金合歓（キンゴウカン）","アカシア","","魂の不死",{"$f":"IFERROR(MATCH(B14,誕生月花!$B$2:$B$13,0),\"\")","v":""},{"$f":"IFERROR(VLOOKUP(B14&C14,誕生日花!E:F,2,FALSE),IFERROR(VLOOKUP(B14,誕生日花!E:F,2,FALSE),\"\"))","v":"2016-03-20"}]
["茜","アカネ","","私を思って",{"$f":"IFERROR(MATCH(B15,誕生月花!$B$2:$B$13,0),\"\")","v":""},{"$f":"IFERROR(VLOOKUP(B15&C15,誕生日花!E:F,2,FALSE),IFERROR(VLOOKUP(B15,誕生日花!E:F,2,FALSE),\"\"))","v":""}]
["茜","アカネ","","媚び",{"$f":"IFERROR(MATCH(B16,誕生月花!$B$2:$B$13,0),\"\")","v":""},{"$f":"IFERROR(VLOOKUP(B16&C16,誕生日花!E:F,2,FALSE),IFERROR(VLOOKUP(B16,誕生日花!E:F,2,FALSE),\"\"))","v":""}]
["紫君子蘭（ムラサキクンシラン）","アガパンサス","","知的な装い",{"$f":"IFERROR(MATCH(B17,誕生月花!$B$2:$B$13,0),\"\")","v":""},{"$f":"IFERROR(VLOOKUP(B17&C17,誕生日花!E:F,2,FALSE),IFERROR(VLOOKUP(B17,誕生日花!E:F,2,FALSE),\"\"))","v":"2016-06-25"}]
["紫君子蘭（ムラサキクンシラン）","アガパンサス","","ラブレター",{"$f":"IFERROR(MATCH(B18,誕生月花!$B$2:$B$13,0),\"\")","v":""},{"$f":"IFERROR(VLOOKUP(B18&C18,誕生日花!E:F,2,FALSE),IFERROR(VLOOKUP(B18,誕生日花!E:F,2,FALSE),\"\"))","v":"2016-06-25"}]
["紫君子蘭（ムラサキクンシラン）","アガパンサス","","恋の訪れ",{"$f":"IFERROR(MATCH(B19,誕生月花!$B$2:$B$13,0),\"\")","v":""},{"$f":"IFERROR(VLOOKUP(B19&C19,誕生日花!E:F,2,FALSE),IFERROR(VLOOKUP(B19,誕生日花!E:F,2,FALSE),\"\"))","v":"2016-06-25"}]
["葉薊（ハアザミ）","アカンサス","","技巧",{"$f":"IFERROR(MATCH(B20,誕生月花!$B$2:$B$13,0),\"\")","v":""},{"$f":"IFERROR(VLOOKUP(B20&C20,誕生日花!E:F,2,FALSE),IFERROR(VLOOKUP(B20,誕生日花!E:F,2,FALSE),\"\"))","v":""}]
["葉薊（ハアザミ）","アカンサス","","芸術",{"$f":"IFERROR(MATCH(B21,誕生月花!$B$2:$B$13,0),\"\")","v":""},{"$f":"IFERROR(VLOOKUP(B21&C21,誕生日花!E:F,2,FALSE),IFERROR(VLOOKUP(B21,誕生日花!E:F,2,FALSE),\"\"))","v":""}]
["秋の麒麟草","アキノキリンソウ","","警戒",{"$f":"IFERROR(MATCH(B22,誕生月花!$B$2:$B$13,0),\"\")","v":""},{"$f":"IFERROR(VLOOKUP(B22&C22,誕生日花!E:F,2,FALSE),IFERROR(VLOOKUP(B22,誕生日花!E:F,2,FALSE),\"\"))","v":""}]
["秋の麒麟草","アキノキリンソウ","","予防",{"$f":"IFERROR(MATCH(B23,誕生月花!$B$2:$B$13,0),\"\")","v":""},{"$f":"IFERROR(VLOOKUP(B23&C23,誕生日花!E:F,2,FALSE),IFERROR(VLOOKUP(B23,誕生日花!E:F,2,FALSE),\"\"))","v":""}]
["秋の麒麟草","アキノキリンソウ","","用心",{"$f":"IFERROR(MATCH(B24,誕生月花!$B$2:$B$13,0),\"\")","v":""},{"$f":"IFERROR(VLOOKUP(B24&C24,誕生日花!E:F,2,FALSE),IFERROR(VLOOKUP(B24,誕生日花!E:F,2,FALSE),\"\"))","v":""}]
["秋の麒麟草","アキノキリンソウ","","励まし",{"$f":"IFERROR(MATCH(B25,誕生月花!$B$2:$B$13,0),\"\")","v":""},{"$f":"IFERROR(VLOOKUP(B25&C25,誕生日花!E:F,2,FALSE),IFERROR(VLOOKUP(B25,誕生日花!E:F,2,FALSE),\"\"))","v":""}]
["秋の野芥子","アキノノゲシ","","クールな恋",{"$f":"IFERROR(MATCH(B26,誕生月花!$B$2:$B$13,0),\"\")","v":""},{"$f":"IFERROR(VLOOKUP(B26&C26,誕生日花!E:F,2,FALSE),IFERROR(VLOOKUP(B26,誕生日花!E:F,2,FALSE),\"\"))","v":"2016-09-29"}]
["西洋金水引（セイヨウキンミズヒキ）","アグリモニー","","多才",{"$f":"IFERROR(MATCH(B27,誕生月花!$B$2:$B$13,0),\"\")","v":""},{"$f":"IFERROR(VLOOKUP(B27&C27,誕生日花!E:F,2,FALSE),IFERROR(VLOOKUP(B27,誕生日花!E:F,2,FALSE),\"\"))","v":""}]
["大霍香薊（オオカッコウアザミ）","アゲラタム","","深い信頼",{"$f":"IFERROR(MATCH(B28,誕生月花!$B$2:$B$13,0),\"\")","v":""},{"$f":"IFERROR(VLOOKUP(B28&C28,誕生日花!E:F,2,FALSE),IFERROR(VLOOKUP(B28,誕生日花!E:F,2,FALSE),\"\"))","v":""}]
["大霍香薊（オオカッコウアザミ）","アゲラタム","","安楽",{"$f":"IFERROR(MATCH(B29,誕生月花!$B$2:$B$13,0),\"\")","v":""},{"$f":"IFERROR(VLOOKUP(B29&C29,誕生日花!E:F,2,FALSE),IFERROR(VLOOKUP(B29,誕生日花!E:F,2,FALSE),\"\"))","v":""}]
["大霍香薊（オオカッコウアザミ）","アゲラタム","","信頼",{"$f":"IFERROR(MATCH(B30,誕生月花!$B$2:$B$13,0),\"\")","v":""},{"$f":"IFERROR(VLOOKUP(B30&C30,誕生日花!E:F,2,FALSE),IFERROR(VLOOKUP(B30,誕生日花!E:F,2,FALSE),\"\"))","v":""}]
["朝顔","アサガオ","","はかない恋",{"$f":"IFERROR(MATCH(B31,誕生月花!$B$2:$B$13,0),\"\")","v":""},{"$f":"IFERROR(VLOOKUP(B31&C31,誕生日花!E:F,2,FALSE),IFERROR(VLOOKUP(B31,誕生日花!E:F,2,FALSE),\"\"))","v":"2016-07-21"}]
["朝顔","アサガオ","","愛情",{"$f":"IFERROR(MATCH(B32,誕生月花!$B$2:$B$13,0),\"\")","v":""},{"$f":"IFERROR(VLOOKUP(B32&C32,誕生日花!E:F,2,FALSE),IFERROR(VLOOKUP(B32,誕生日花!E:F,2,FALSE),\"\"))","v":"2016-07-21"}]
["朝顔","アサガオ","","固い絆",{"$f":"IFERROR(MATCH(B33,誕生月花!$B$2:$B$13,0),\"\")","v":""},{"$f":"IFERROR(VLOOKUP(B33&C33,誕生日花!E:F,2,FALSE),IFERROR(VLOOKUP(B33,誕生日花!E:F,2,FALSE),\"\"))","v":"2016-07-21"}]
["朝顔","アサガオ","","偉大なる友情",{"$f":"IFERROR(MATCH(B34,誕生月花!$B$2:$B$13,0),\"\")","v":""},{"$f":"IFERROR(VLOOKUP(B34&C34,誕生日花!E:F,2,FALSE),IFERROR(VLOOKUP(B34,誕生日花!E:F,2,FALSE),\"\"))","v":"2016-07-21"}]
["朝顔","アサガオ","白","喜び溢れ",{"$f":"IFERROR(MATCH(B35,誕生月花!$B$2:$B$13,0),\"\")","v":""},{"$f":"IFERROR(VLOOKUP(B35&C35,誕生日花!E:F,2,FALSE),IFERROR(VLOOKUP(B35,誕生日花!E:F,2,FALSE),\"\"))","v":"2016-07-21"}]
["薊","アザミ","","独立",{"$f":"IFERROR(MATCH(B36,誕生月花!$B$2:$B$13,0),\"\")","v":""},{"$f":"IFERROR(VLOOKUP(B36&C36,誕生日花!E:F,2,FALSE),IFERROR(VLOOKUP(B36,誕生日花!E:F,2,FALSE),\"\"))","v":"2016-05-12"}]
["薊","アザミ","","厳格",{"$f":"IFERROR(MATCH(B37,誕生月花!$B$2:$B$13,0),\"\")","v":""},{"$f":"IFERROR(VLOOKUP(B37&C37,誕生日花!E:F,2,FALSE),IFERROR(VLOOKUP(B37,誕生日花!E:F,2,FALSE),\"\"))","v":"2016-05-12"}]
["薊","アザミ","","触れないで",{"$f":"IFERROR(MATCH(B38,誕生月花!$B$2:$B$13,0),\"\")","v":""},{"$f":"IFERROR(VLOOKUP(B38&C38,誕生日花!E:F,2,FALSE),IFERROR(VLOOKUP(B38,誕生日花!E:F,2,FALSE),\"\"))","v":"2016-05-12"}]
["薊","アザミ","","報復",{"$f":"IFERROR(MATCH(B39,誕生月花!$B$2:$B$13,0),\"\")","v":""},{"$f":"IFERROR(VLOOKUP(B39&C39,誕生日花!E:F,2,FALSE),IFERROR(VLOOKUP(B39,誕生日花!E:F,2,FALSE),\"\"))","v":"2016-05-12"}]
["西洋躑躅（セイヨウツツジ）","アザレア","","禁酒",{"$f":"IFERROR(MATCH(B40,誕生月花!$B$2:$B$13,0),\"\")","v":""},{"$f":"IFERROR(VLOOKUP(B40&C40,誕生日花!E:F,2,FALSE),IFERROR(VLOOKUP(B40,誕生日花!E:F,2,FALSE),\"\"))","v":"2016-02-13"}]
["西洋躑躅（セイヨウツツジ）","アザレア","","節制",{"$f":"IFERROR(MATCH(B41,誕生月花!$B$2:$B$13,0),\"\")","v":""},{"$f":"IFERROR(VLOOKUP(B41&C41,誕生日花!E:F,2,FALSE),IFERROR(VLOOKUP(B41,誕生日花!E:F,2,FALSE),\"\"))","v":"2016-02-13"}]
["西洋躑躅（セイヨウツツジ）","アザレア","","恋の喜び",{"$f":"IFERROR(MATCH(B42,誕生月花!$B$2:$B$13,0),\"\")","v":""},{"$f":"IFERROR(VLOOKUP(B42&C42,誕生日花!E:F,2,FALSE),IFERROR(VLOOKUP(B42,誕生日花!E:F,2,FALSE),\"\"))","v":"2016-02-13"}]
["西洋躑躅（セイヨウツツジ）","アザレア","","愛で満たされる",{"$f":"IFERROR(MATCH(B43,誕生月花!$B$2:$B$13,0),\"\")","v":""},{"$f":"IFERROR(VLOOKUP(B43&C43,誕生日花!E:F,2,FALSE),IFERROR(VLOOKUP(B43,誕生日花!E:F,2,FALSE),\"\"))","v":"2016-02-13"}]
["西洋躑躅（セイヨウツツジ）","アザレア","赤","自制心",{"$f":"IFERROR(MATCH(B44,誕生月花!$B$2:$B$13,0),\"\")","v":""},{"$f":"IFERROR(VLOOKUP(B44&C44,誕生日花!E:F,2,FALSE),IFERROR(VLOOKUP(B44,誕生日花!E:F,2,FALSE),\"\"))","v":"2016-12-05"}]
["西洋躑躅（セイヨウツツジ）","アザレア","白","節制",{"$f":"IFERROR(MATCH(B45,誕生月花!$B$2:$B$13,0),\"\")","v":""},{"$f":"IFERROR(VLOOKUP(B45&C45,誕生日花!E:F,2,FALSE),IFERROR(VLOOKUP(B45,誕生日花!E:F,2,FALSE),\"\"))","v":"2016-02-13"}]
["西洋躑躅（セイヨウツツジ）","アザレア","白","あなたに愛されて幸せ",{"$f":"IFERROR(MATCH(B46,誕生月花!$B$2:$B$13,0),\"\")","v":""},{"$f":"IFERROR(VLOOKUP(B46&C46,誕生日花!E:F,2,FALSE),IFERROR(VLOOKUP(B46,誕生日花!E:F,2,FALSE),\"\"))","v":"2016-02-13"}]
["西洋躑躅（セイヨウツツジ）","アザレア","白","充足",{"$f":"IFERROR(MATCH(B47,誕生月花!$B$2:$B$13,0),\"\")","v":""},{"$f":"IFERROR(VLOOKUP(B47&C47,誕生日花!E:F,2,FALSE),IFERROR(VLOOKUP(B47,誕生日花!E:F,2,FALSE),\"\"))","v":"2016-02-13"}]
["唐草蓬莱羊歯（カラクサホウライシダ）","アジアンタム","","繊細",{"$f":"IFERROR(MATCH(B48,誕生月花!$B$2:$B$13,0),\"\")","v":""},{"$f":"IFERROR(VLOOKUP(B48&C48,誕生日花!E:F,2,FALSE),IFERROR(VLOOKUP(B48,誕生日花!E:F,2,FALSE),\"\"))","v":""}]
["唐草蓬莱羊歯（カラクサホウライシダ）","アジアンタム","","天真爛漫",{"$f":"IFERROR(MATCH(B49,誕生月花!$B$2:$B$13,0),\"\")","v":""},{"$f":"IFERROR(VLOOKUP(B49&C49,誕生日花!E:F,2,FALSE),IFERROR(VLOOKUP(B49,誕生日花!E:F,2,FALSE),\"\"))","v":""}]
["紫陽花","アジサイ","","移り気",{"$f":"IFERROR(MATCH(B50,誕生月花!$B$2:$B$13,0),\"\")","v":""},{"$f":"IFERROR(VLOOKUP(B50&C50,誕生日花!E:F,2,FALSE),IFERROR(VLOOKUP(B50,誕生日花!E:F,2,FALSE),\"\"))","v":"2016-06-15"}]
["紫陽花","アジサイ","","高慢",{"$f":"IFERROR(MATCH(B51,誕生月花!$B$2:$B$13,0),\"\")","v":""},{"$f":"IFERROR(VLOOKUP(B51&C51,誕生日花!E:F,2,FALSE),IFERROR(VLOOKUP(B51,誕生日花!E:F,2,FALSE),\"\"))","v":"2016-06-15"}]
["紫陽花","アジサイ","","辛抱強さ",{"$f":"IFERROR(MATCH(B52,誕生月花!$B$2:$B$13,0),\"\")","v":""},{"$f":"IFERROR(VLOOKUP(B52&C52,誕生日花!E:F,2,FALSE),IFERROR(VLOOKUP(B52,誕生日花!E:F,2,FALSE),\"\"))","v":"2016-06-15"}]
["紫陽花","アジサイ","","無情",{"$f":"IFERROR(MATCH(B53,誕生月花!$B$2:$B$13,0),\"\")","v":""},{"$f":"IFERROR(VLOOKUP(B53&C53,誕生日花!E:F,2,FALSE),IFERROR(VLOOKUP(B53,誕生日花!E:F,2,FALSE),\"\"))","v":"2016-06-15"}]
["紫陽花","アジサイ","","冷酷",{"$f":"IFERROR(MATCH(B54,誕生月花!$B$2:$B$13,0),\"\")","v":""},{"$f":"IFERROR(VLOOKUP(B54&C54,誕生日花!E:F,2,FALSE),IFERROR(VLOOKUP(B54,誕生日花!E:F,2,FALSE),\"\"))","v":"2016-06-15"}]
["紫陽花","アジサイ","","冷淡",{"$f":"IFERROR(MATCH(B55,誕生月花!$B$2:$B$13,0),\"\")","v":""},{"$f":"IFERROR(VLOOKUP(B55&C55,誕生日花!E:F,2,FALSE),IFERROR(VLOOKUP(B55,誕生日花!E:F,2,FALSE),\"\"))","v":"2016-06-15"}]
["紫陽花","アジサイ","白","寛容",{"$f":"IFERROR(MATCH(B56,誕生月花!$B$2:$B$13,0),\"\")","v":""},{"$f":"IFERROR(VLOOKUP(B56&C56,誕生日花!E:F,2,FALSE),IFERROR(VLOOKUP(B56,誕生日花!E:F,2,FALSE),\"\"))","v":"2016-06-15"}]
["西洋十二単（セイヨウジュウニヒトエ）","アジュガ","","強い友情",{"$f":"IFERROR(MATCH(B57,誕生月花!$B$2:$B$13,0),\"\")","v":""},{"$f":"IFERROR(VLOOKUP(B57&C57,誕生日花!E:F,2,FALSE),IFERROR(VLOOKUP(B57,誕生日花!E:F,2,FALSE),\"\"))","v":""}]
["西洋十二単（セイヨウジュウニヒトエ）","アジュガ","","心休まる家庭",{"$f":"IFERROR(MATCH(B58,誕生月花!$B$2:$B$13,0),\"\")","v":""},{"$f":"IFERROR(VLOOKUP(B58&C58,誕生日花!E:F,2,FALSE),IFERROR(VLOOKUP(B58,誕生日花!E:F,2,FALSE),\"\"))","v":""}]
["唐綿（トウワタ）","アスクレピアス","","移り気",{"$f":"IFERROR(MATCH(B59,誕生月花!$B$2:$B$13,0),\"\")","v":""},{"$f":"IFERROR(VLOOKUP(B59&C59,誕生日花!E:F,2,FALSE),IFERROR(VLOOKUP(B59,誕生日花!E:F,2,FALSE),\"\"))","v":"2016-09-16"}]
["蝦夷菊（エゾギク）","アスター","","信じる心",{"$f":"IFERROR(MATCH(B60,誕生月花!$B$2:$B$13,0),\"\")","v":""},{"$f":"IFERROR(VLOOKUP(B60&C60,誕生日花!E:F,2,FALSE),IFERROR(VLOOKUP(B60,誕生日花!E:F,2,FALSE),\"\"))","v":"2016-03-07"}]
["泡盛草（アワモリソウ）","アスチルベ","","自由",{"$f":"IFERROR(MATCH(B61,誕生月花!$B$2:$B$13,0),\"\")","v":""},{"$f":"IFERROR(VLOOKUP(B61&C61,誕生日花!E:F,2,FALSE),IFERROR(VLOOKUP(B61,誕生日花!E:F,2,FALSE),\"\"))","v":""}]
["泡盛草（アワモリソウ）","アスチルベ","","恋の訪れ",{"$f":"IFERROR(MATCH(B62,誕生月花!$B$2:$B$13,0),\"\")","v":""},{"$f":"IFERROR(VLOOKUP(B62&C62,誕生日花!E:F,2,FALSE),IFERROR(VLOOKUP(B62,誕生日花!E:F,2,FALSE),\"\"))","v":""}]
["山鳴ラシ（ヤマナラシ）","アスペン","","自信と勇気",{"$f":"IFERROR(MATCH(B63,誕生月花!$B$2:$B$13,0),\"\")","v":""},{"$f":"IFERROR(VLOOKUP(B63&C63,誕生日花!E:F,2,FALSE),IFERROR(VLOOKUP(B63,誕生日花!E:F,2,FALSE),\"\"))","v":""}]
["馬酔木","アセビ","","あなたと二人で旅をしましょう",{"$f":"IFERROR(MATCH(B64,誕生月花!$B$2:$B$13,0),\"\")","v":""},{"$f":"IFERROR(VLOOKUP(B64&C64,誕生日花!E:F,2,FALSE),IFERROR(VLOOKUP(B64,誕生日花!E:F,2,FALSE),\"\"))","v":""}]
["馬酔木","アセビ","","犠牲",{"$f":"IFERROR(MATCH(B65,誕生月花!$B$2:$B$13,0),\"\")","v":""},{"$f":"IFERROR(VLOOKUP(B65&C65,誕生日花!E:F,2,FALSE),IFERROR(VLOOKUP(B65,誕生日花!E:F,2,FALSE),\"\"))","v":""}]
["馬酔木","アセビ","","献身",{"$f":"IFERROR(MATCH(B66,誕生月花!$B$2:$B$13,0),\"\")","v":""},{"$f":"IFERROR(VLOOKUP(B66&C66,誕生日花!E:F,2,FALSE),IFERROR(VLOOKUP(B66,誕生日花!E:F,2,FALSE),\"\"))","v":""}]
["アッツ桜","アッツザクラ","","無意識",{"$f":"IFERROR(MATCH(B67,誕生月花!$B$2:$B$13,0),\"\")","v":""},{"$f":"IFERROR(VLOOKUP(B67&C67,誕生日花!E:F,2,FALSE),IFERROR(VLOOKUP(B67,誕生日花!E:F,2,FALSE),\"\"))","v":"2016-01-07"}]
["牡丹一華（ボタンイチゲ）","アネモネ","","はかない恋",{"$f":"IFERROR(MATCH(B68,誕生月花!$B$2:$B$13,0),\"\")","v":""},{"$f":"IFERROR(VLOOKUP(B68&C68,誕生日花!E:F,2,FALSE),IFERROR(VLOOKUP(B68,誕生日花!E:F,2,FALSE),\"\"))","v":"2016-03-06"}]
["牡丹一華（ボタンイチゲ）","アネモネ","","見捨てられた",{"$f":"IFERROR(MATCH(B69,誕生月花!$B$2:$B$13,0),\"\")","v":""},{"$f":"IFERROR(VLOOKUP(B69&C69,誕生日花!E:F,2,FALSE),IFERROR(VLOOKUP(B69,誕生日花!E:F,2,FALSE),\"\"))","v":"2016-03-06"}]
["牡丹一華（ボタンイチゲ）","アネモネ","","見放された",{"$f":"IFERROR(MATCH(B70,誕生月花!$B$2:$B$13,0),\"\")","v":""},{"$f":"IFERROR(VLOOKUP(B70&C70,誕生日花!E:F,2,FALSE),IFERROR(VLOOKUP(B70,誕生日花!E:F,2,FALSE),\"\"))","v":"2016-03-06"}]
["牡丹一華（ボタンイチゲ）","アネモネ","","恋の苦しみ",{"$f":"IFERROR(MATCH(B71,誕生月花!$B$2:$B$13,0),\"\")","v":""},{"$f":"IFERROR(VLOOKUP(B71&C71,誕生日花!E:F,2,FALSE),IFERROR(VLOOKUP(B71,誕生日花!E:F,2,FALSE),\"\"))","v":"2016-03-06"}]
["牡丹一華（ボタンイチゲ）","アネモネ","","遊び",{"$f":"IFERROR(MATCH(B72,誕生月花!$B$2:$B$13,0),\"\")","v":""},{"$f":"IFERROR(VLOOKUP(B72&C72,誕生日花!E:F,2,FALSE),IFERROR(VLOOKUP(B72,誕生日花!E:F,2,FALSE),\"\"))","v":"2016-03-06"}]
["牡丹一華（ボタンイチゲ）","アネモネ","紫","あなたを信じて待つ",{"$f":"IFERROR(MATCH(B73,誕生月花!$B$2:$B$13,0),\"\")","v":""},{"$f":"IFERROR(VLOOKUP(B73&C73,誕生日花!E:F,2,FALSE),IFERROR(VLOOKUP(B73,誕生日花!E:F,2,FALSE),\"\"))","v":"2016-03-06"}]
["牡丹一華（ボタンイチゲ）","アネモネ","赤","君を愛する",{"$f":"IFERROR(MATCH(B74,誕生月花!$B$2:$B$13,0),\"\")","v":""},{"$f":"IFERROR(VLOOKUP(B74&C74,誕生日花!E:F,2,FALSE),IFERROR(VLOOKUP(B74,誕生日花!E:F,2,FALSE),\"\"))","v":"2016-03-06"}]
["牡丹一華（ボタンイチゲ）","アネモネ","白","希望",{"$f":"IFERROR(MATCH(B75,誕生月花!$B$2:$B$13,0),\"\")","v":""},{"$f":"IFERROR(VLOOKUP(B75&C75,誕生日花!E:F,2,FALSE),IFERROR(VLOOKUP(B75,誕生日花!E:F,2,FALSE),\"\"))","v":"2016-03-06"}]
["牡丹一華（ボタンイチゲ）","アネモネ","白","期待",{"$f":"IFERROR(MATCH(B76,誕生月花!$B$2:$B$13,0),\"\")","v":""},{"$f":"IFERROR(VLOOKUP(B76&C76,誕生日花!E:F,2,FALSE),IFERROR(VLOOKUP(B76,誕生日花!E:F,2,FALSE),\"\"))","v":"2016-03-06"}]
["牡丹一華（ボタンイチゲ）","アネモネ","白","真実",{"$f":"IFERROR(MATCH(B77,誕生月花!$B$2:$B$13,0),\"\")","v":""},{"$f":"IFERROR(VLOOKUP(B77&C77,誕生日花!E:F,2,FALSE),IFERROR(VLOOKUP(B77,誕生日花!E:F,2,FALSE),\"\"))","v":"2016-03-06"}]
["アフリカン金盞花","アフリカンキンセンカ","","元気",{"$f":"IFERROR(MATCH(B78,誕生月花!$B$2:$B$13,0),\"\")","v":""},{"$f":"IFERROR(VLOOKUP(B78&C78,誕生日花!E:F,2,FALSE),IFERROR(VLOOKUP(B78,誕生日花!E:F,2,FALSE),\"\"))","v":"2016-02-11"}]
["花衝羽根空木（ハナツクバネウツギ）","アベリア","","謙虚",{"$f":"IFERROR(MATCH(B79,誕生月花!$B$2:$B$13,0),\"\")","v":""},{"$f":"IFERROR(VLOOKUP(B79&C79,誕生日花!E:F,2,FALSE),IFERROR(VLOOKUP(B79,誕生日花!E:F,2,FALSE),\"\"))","v":""}]
["花衝羽根空木（ハナツクバネウツギ）","アベリア","","強運",{"$f":"IFERROR(MATCH(B80,誕生月花!$B$2:$B$13,0),\"\")","v":""},{"$f":"IFERROR(VLOOKUP(B80&C80,誕生日花!E:F,2,FALSE),IFERROR(VLOOKUP(B80,誕生日花!E:F,2,FALSE),\"\"))","v":""}]
{"$rows_left_out":1622}
{"sheet":"誕生月花","index":2,"n_rows":13,"n_cols":3,"rows_kept":13,"cut":false,"hidden":true,"merged":[]}
["誕生月","誕生月花","花言葉"]
[1,"シンビジウム","飾らない心"]
[2,"フリージア","純愛"]
[3,"チューリップ","正直"]
[4,"サクラ","高潔"]
[5,"スズラン","幸福の再来"]
[6,"バラ","ジェラシー"]
[7,"ユリ","純潔"]
[8,"ヒマワリ","栄光"]
[9,"ダリア","エレガント"]
[10,"ガーベラ","神秘"]
[11,"シクラメン","はずかしがり"]
[12,"ポインセチア","祝福"]

{"sheet":"誕生日花","index":3,"n_rows":367,"n_cols":6,"rows_kept":367,"cut":false,"hidden":true,"merged":[[0,1,0,2]]}
["誕生日","誕生日花",null,"花言葉","検索","誕生日"]
["2016-01-01","フクジュソウ","","幸せを招く",{"$f":"B2&C2","v":"フクジュソウ"},{"$f":"A2","v":"2016-01-01"}]
["2016-01-02","ハルサザンカ","","困難に勝つ",{"$f":"B3&C3","v":"ハルサザンカ"},{"$f":"A3","v":"2016-01-02"}]
["2016-01-03","ストレリチア","","ひとり占め","ストレリチア","2016-01-03"]
["2016-01-04","ブルースター","","幸せな愛","ブルースター","2016-01-04"]
["2016-01-05","ラッパスイセン","","再生","ラッパスイセン","2016-01-05"]
["2016-01-06","カーネーション","ピンク","熱愛","カーネーションピンク","2016-01-06"]
["2016-01-07","アッツザクラ","","愛を待つ","アッツザクラ","2016-01-07"]
["2016-01-08","マンリョウ","","予言","マンリョウ","2016-01-08"]
["2016-01-09","ユキワリソウ","","期待","ユキワリソウ","2016-01-09"]
["2016-01-10","ナワシロイチゴ","","恩恵","ナワシロイチゴ","2016-01-10"]
["2016-01-11","コチョウラン","白","愛をあなたへ","コチョウラン白","2016-01-11"]
["2016-01-12","カンツバキ","","謙譲","カンツバキ","2016-01-12"]
["2016-01-13","マンサク","","新鮮","マンサク","2016-01-13"]
["2016-01-14","ブルーデイジー","","恵まれて","ブルーデイジー","2016-01-14"]
["2016-01-15","ポピー","","やすらぎ","ポピー","2016-01-15"]
["2016-01-16","オキザリス","","ひたむきな愛","オキザリス","2016-01-16"]
["2016-01-17","スイカズラ","","愛の絆","スイカズラ","2016-01-17"]
["2016-01-18","グズマニア","","完璧","グズマニア","2016-01-18"]
["2016-01-19","ストック","八重","永遠の美","ストック八重","2016-01-19"]
["2016-01-20","スイートピー","","永遠の喜び","スイートピー","2016-01-20"]
["2016-01-21","スイセン","","自己愛","スイセン","2016-01-21"]
["2016-01-22","リカステ","","快活","リカステ","2016-01-22"]
["2016-01-23","オウバイ","","高貴","オウバイ","2016-01-23"]
["2016-01-24","ヒヤシンス","紫","優しくかわいい","ヒヤシンス紫","2016-01-24"]
["2016-01-25","チューリップ","黄","正直","チューリップ黄","2016-01-25"]
["2016-01-26","ピグミーランタン","","印象","ピグミーランタン","2016-01-26"]
["2016-01-27","マダガスカルジャスミン","","自意識","マダガスカルジャスミン","2016-01-27"]
["2016-01-28","キンギョソウ","","欲望","キンギョソウ","2016-01-28"]
["2016-01-29","スミレ","","誠実な愛","スミレ","2016-01-29"]
["2016-01-30","サクラソウ","","忠実","サクラソウ","2016-01-30"]
["2016-01-31","ウメ","白","澄んだ心","ウメ白","2016-01-31"]
["2016-02-01","フリージア","黄","純愛","フリージア黄","2016-02-01"]
["2016-02-02","シラー","","冷静","シラー","2016-02-02"]
["2016-02-03","シクラメン","ピンク","はずかしがり","シクラメンピンク","2016-02-03"]
["2016-02-04","プリムラ","ポリアンサ","ひたむきな愛","プリムラポリアンサ","2016-02-04"]
["2016-02-05","スイレン","","信仰","スイレン","2016-02-05"]
["2016-02-06","ビワ","","愛の記憶","ビワ","2016-02-06"]
["2016-02-07","スノードロップ","","初恋のため息","スノードロップ","2016-02-07"]
["2016-02-08","ハナシノブ","","野生美","ハナシノブ","2016-02-08"]
["2016-02-09","クリスマスローズ","","大切な人","クリスマスローズ","2016-02-09"]
["2016-02-10","バラ","黄","ジェラシー","バラ黄","2016-02-10"]
["2016-02-11","アフリカンキンセンカ","","元気","アフリカンキンセンカ","2016-02-11"]
["2016-02-12","スプレーギク","","寛大","スプレーギク","2016-02-12"]
["2016-02-13","アザレア","","愛される喜び","アザレア","2016-02-13"]
["2016-02-14","サクシフラガ","","自信","サクシフラガ","2016-02-14"]
["2016-02-15","サンシュユ","","永遠","サンシュユ","2016-02-15"]
["2016-02-16","フリージア","白","無邪気","フリージア白","2016-02-16"]
["2016-02-17","ネコヤナギ","","素直","ネコヤナギ","2016-02-17"]
["2016-02-18","ヒマラヤユキノシタ","","順応","ヒマラヤユキノシタ","2016-02-18"]
["2016-02-19","プリムラ","ジュリアン","永続する愛","プリムラジュリアン","2016-02-19"]
["2016-02-20","コブシ","","友情","コブシ","2016-02-20"]
["2016-02-21","ウメ","紅","忠実","ウメ紅","2016-02-21"]
["2016-02-22","ビオラ","","誠実","ビオラ","2016-02-22"]
["2016-02-23","ストック","一重","不変の愛","ストック一重","2016-02-23"]
["2016-02-24","ニッコウキスゲ","","勤勉","ニッコウキスゲ","2016-02-24"]
["2016-02-25","バイモ","","飾らない心","バイモ","2016-02-25"]
["2016-02-26","ミズバショウ","","決心","ミズバショウ","2016-02-26"]
["2016-02-27","ミルトニア","","愛の訪れ","ミルトニア","2016-02-27"]
["2016-02-28","ロウバイ","","温かみ","ロウバイ","2016-02-28"]
["2016-02-29","パンジー","","もの思い","パンジー","2016-02-29"]
["2016-03-01","ボケ","","知恵","ボケ","2016-03-01"]
["2016-03-02","アリッサム","","仲直り","アリッサム","2016-03-02"]
["2016-03-03","ナノハナ","","予期せぬ出会い","ナノハナ","2016-03-03"]
["2016-03-04","ヒヤシンス","ピンク","勝負","ヒヤシンスピンク","2016-03-04"]
["2016-03-05","オランダアヤメ","","メッセージ","オランダアヤメ","2016-03-05"]
["2016-03-06","アネモネ","","はかない恋",{"$f":"B67&C67","v":"アネモネ"},{"$f":"A67","v":"2016-03-06"}]
["2016-03-07","アスター","","甘い夢","アスター","2016-03-07"]
["2016-03-08","ワックスフラワー","","思いのたけ","ワックスフラワー","2016-03-08"]
["2016-03-09","アルメリア","","共感","アルメリア","2016-03-09"]
["2016-03-10","レンギョウ","","集中力","レンギョウ","2016-03-10"]
["2016-03-11","ヒガンザクラ","","優れた美人","ヒガンザクラ","2016-03-11"]
["2016-03-12","キャンディタフト","","復活","キャンディタフト","2016-03-12"]
["2016-03-13","ノースポール","","誠実","ノースポール","2016-03-13"]
["2016-03-14","モモ","","あなたのとりこ","モモ","2016-03-14"]
["2016-03-15","ヤグルマソウ","","繊細","ヤグルマソウ","2016-03-15"]
["2016-03-16","ビジョナデシコ","","清い愛","ビジョナデシコ","2016-03-16"]
["2016-03-17","ブルーレースフラワー","","無言の愛","ブルーレースフラワー","2016-03-17"]
["2016-03-18","ジンチョウゲ","","不老長寿","ジンチョウゲ","2016-03-18"]
["2016-03-19","レンゲソウ","","実り多き幸せ","レンゲソウ","2016-03-19"]
{"$rows_left_out":288}
{"sheet":"国花","index":4,"n_rows":228,"n_cols":2,"rows_kept":228,"cut":false,"hidden":true,"merged":[]}
["アフガニスタン","赤いチューリップ"]
["イエメン","アラビカコーヒーノキ"]
["イスラエル","オリーブ"]
["イスラエル","シクラメン"]
["イラク","赤いバラ"]
["イラン","黄色いつる性のバラ"]
["イラン","チューリップ"]
["インド","蓮"]
["インド","印度菩提樹"]
["インドネシア","メラティ(マツリカ)"]
["インドネシア","コチョウラン"]
["インドネシア","ラフレシア"]
["インドネシア","スマトラオオコンニャク"]
["オマーン","赤いバラ"]
["カザフスタン","チューリップ"]
["カタール","ナツメヤシ"]
["韓国","ムクゲ"]
["カンボジア","ラムドゥアン"]
["カンボジア","稲"]
["北朝鮮","李"]
["北朝鮮","木蘭(オオヤマレンゲ)"]
["キルギス","ワタ"]
["キルギス","バラ"]
["キルギス","チューリップ"]
["クウェート","アル・アルファジ"]
["ジョージア","ヨーロッパブドウ"]
["シリア","ダマスクローズ"]
["シンガポール","バンダ・ミスジョアキム"]
["スリランカ","ニル・マーネル"]
["タイ","ナンバンサイカチ"]
["タイ","スイレン"]
["香港","バウヒニア"]
["マカオ","蓮"]
["トルコ","チューリップ"]
["日本","桜"]
["日本","菊"]
["中華民国","梅"]
["ネパール","ラリグラス"]
["パキスタン","ソケイ"]
["パレスチナ","オリーブ"]
["バングラデシュ","シャープラ (ネッタイスイレン)"]
["フィリピン","サンパギータ(マツリカ)"]
["フィリピン","メコノプシス・ホリデュラ"]
["ブルネイ","カンボクビワモドキ"]
["ベトナム","紅い蓮"]
["ベトナム","竹"]
["マレーシア","ブンガラヤ(ブッソウゲ)"]
["ミャンマー","サラノキ"]
["ミャンマー","カリン (マメ科)"]
["ミャンマー","アカバナサンタンカ"]
["モンゴル","セイヨウマツムシソウ"]
["ヨルダン","ブラックアイリス"]
["ラオス","インドソケイ"]
["レバノン","レバノンスギ"]
["アルジェリア","バラ"]
["エチオピア","カラー(オランダカイウ)"]
["エジプト","ロータス(ヨザキスイレン)"]
["ガーナ","ナツメヤシ"]
["ガボン","カエンボク"]
["コートジボワール","ヤシ"]
["コートジボワール","ニオイマホガニー"]
["シエラレオネ","ギネアアブラヤシ"]
["ジンバブエ","グロリオサ・ロスチャイルディアナ"]
["スーダン","ブッソウゲ"]
["赤道ギニア","カポック(パンヤ)"]
["セネガル","バオバブ"]
["チュニジア","ミモザ"]
["チュニジア","オオバナソケイ"]
["ナイジェリア","コスタス・スペクタビリス"]
["ナミビア","ウェルウィッチア"]
["ボツワナ","モロコシ"]
["マダガスカル","ポインセチア"]
["マダガスカル","タビビトノキ"]
["南アフリカ共和国","キングプロテア"]
["モーリシャス","トロチェティア"]
["モロッコ","バラ"]
["モロッコ","ザクロ"]
["リベリア","コショウ"]
["アイスランド","チョウノスケソウ"]
["アイルランド","シャムロック"]
{"$rows_left_out":149}
{"sheet":"県花","index":5,"n_rows":49,"n_cols":2,"rows_kept":49,"cut":false,"hidden":true,"merged":[]}
["北海道","ハマナス"]
["青森県","りんごの花"]
["岩手県","キリ"]
["宮城県","ミヤギノハギ"]
["秋田県","フキのとう"]
["山形県","べにばな（紅花）"]
["福島県","ネモトシャクナゲ"]
["茨城県","バラ"]
["栃木県","やしおつつじ"]
["群馬県","レンゲツツジ"]
["埼玉県","サクラソウ"]
["千葉県","なのはな"]
["東京都","ソメイヨシノ"]
["神奈川県","ヤマユリ"]
["新潟県","チューリップ"]
["新潟県","雪割草"]
["富山県","チューリップ"]
["石川県","クロユリ"]
["福井県","スイセン"]
["山梨県","ふじさくら"]
["長野県","りんどう"]
["岐阜県","れんげ"]
["静岡県","つつじ"]
["愛知県","カキツバタ"]
["三重県","ハナショウブ"]
["滋賀県","石楠花"]
["京都府","しだれ桜"]
["京都府","嵯峨ぎく・なでしこ"]
["大阪府","うめ・さくらそう"]
["兵庫県","ノジギク"]
["奈良県","奈良八重桜"]
["和歌山県","ウメ"]
["鳥取県","二十世紀梨の花"]
["島根県","ボタン"]
["岡山県","ももの花"]
["広島県","モミジ"]
["山口県","夏みかんの花"]
["徳島県","すだちの花"]
["香川県","オリーブ"]
["愛媛県","みかんの花"]
["高知県","ヤマモモ"]
["福岡県","うめ"]
["佐賀県","クスの花"]
["長崎県","雲仙ツツジ"]
["熊本県","リンドウ"]
["大分県","豊後梅"]
["宮崎県","はまゆう"]
["鹿児島県","ミヤマキリシマ"]
["沖縄県","デイゴ"]