{"text_format":"1","workbook":"xlsx","n_sheets":6,"sheets":["Flowchart","システムフロー作成用情報登録","引継選択","作業","標準ファイル名称","STEP_ALL"],"not_rendered":{"charts":0,"images":0,"macros":1,"external_links":0,"defined_names":1,"comments":2,"pivot_tables":0},"unopened":[],"bounds":{"document_bytes":16777216,"sheet_cells":100000,"rows_first":2000,"rows_last":500,"rows_between":2000,"halvings":0,"cell_chars":16384,"cell_head_chars":4096},"cells_cut":0,"cells_raw":0,"read":"whole","date_system":"1900"}

{"sheet":"Flowchart","index":0,"n_rows":1,"n_cols":65,"rows_kept":1,"cut":false,"hidden":false,"merged":[[0,64,0,67],[1,0,1,11],[1,12,1,24],[1,25,1,38],[1,39,1,50],[1,51,1,58],[1,59,1,63],[1,64,1,67],[0,0,0,11],[0,12,0,24],[0,25,0,38],[0,40,0,50],[0,51,0,58],[0,59,0,63]]}
["会社名",null,null,null,null,null,null,null,null,null,null,null,"システム名",null,null,null,null,null,null,null,null,null,null,null,null,"サブシステム名",null,null,null,null,null,null,null,null,null,null,null,null,null,null,"機能名・他",null,null,null,null,null,null,null,null,null,null,"作成日",null,null,null,null,null,null,null,"作成者",null,null,null,null,"頁"]

{"sheet":"システムフロー作成用情報登録","index":1,"n_rows":60,"n_cols":47,"rows_kept":60,"cut":false,"hidden":false,"merged":[[6,2,6,4],[7,2,7,4],[0,5,0,6],[2,1,2,4],[3,1,3,4],[6,6,6,8],[0,8,0,10],[0,2,0,4],[2,9,2,10],[3,9,3,10],[2,6,2,8],[3,6,3,8],[8,35,8,36],[8,29,8,34],[9,15,9,16],[9,9,9,10],[7,6,7,8],[9,22,9,23]]}
[null,"会社名",null,null,null,"【システムフロー作成用情報登録】",null,null,{"$f":"TODAY()","v":"2020-04-21"}]
[]
[null,"システム名",null,null,null,"サブシステム名","機能名・他",null,null,"作成者"]
[]
[]
[null,"新規","更新",null,null,null,null,null,null,{"$f":"IF(AND(C8=\"\",D11=\"\"),\"\",IF(AND(B6=\"更新\",AJ9=0),\"※更新済\",\"※未更新\"))","v":""}]
{"$rows_left_out":55}
{"sheet":"引継選択","index":2,"n_rows":55,"n_cols":32,"rows_kept":55,"cut":false,"hidden":false,"merged":[[4,27,4,28],[4,11,4,12],[0,23,0,24],[2,27,2,28],[1,4,1,5],[2,4,2,5],[3,30,3,31],[3,15,3,16],[1,2,1,3],[2,2,2,3],[0,4,0,5],[0,8,0,9]]}
[null,null,null,null,"《引継ファイル選択処理》",null,null,null,{"$f":"TODAY()","v":"2020-04-21"}]
[{"$f":"IF(B3=0,\"\",システムフロー作成用情報登録!B8)","v":""},"step","プログラム名",null,"機能内容"]
[{"$f":"IF(B3=0,\"\",IF(B3=システムフロー作成用情報登録!B8-1,\"フロー連結あり\",\"フロー連結なし\"))","v":""},0,{"$f":"IFERROR(VLOOKUP(B3&\"-0\",STEP_ALL!A:G,7,FALSE),\"\")","v":""},null,{"$f":"IFERROR(VLOOKUP(B3&\"-0\",STEP_ALL!A:G,6,FALSE),\"\")","v":""},null,null,null,null,null,null,null,null,null,null,null,null,null,null,null,null,null,null,null,null,null,null,"ｽﾃｯﾌﾟ範囲"]
[null,null,null,null,null,null,null,null,null,null,null,null,null,null,null,"引継仮選択",null,null,null,null,null,null,null,null,null,null,null,{"$f":"AD6","v":""},{"$f":"MAX(AD:AD)","v":0},null,"引継仮選択"]
[null,"№","アクセス名","媒体","ファイル名","FORM名等","備考1","備考２","引継№","選択","№","既存引継№",null,"step","解除なし","№","キー",null,"№","キー","№","ｱｸｾｽ名","媒体","ファイル名","MED名","備考1","備考２","引継№",null,"step","№","キー"]
[1,{"$f":"IFERROR(VLOOKUP($A6,$S:$AD,3,FALSE),\"\")","v":""},{"$f":"IFERROR(VLOOKUP($A6,$S:$AD,4,FALSE),\"\")","v":""},{"$f":"IFERROR(VLOOKUP($A6,$S:$AD,5,FALSE),\"\")","v":""},{"$f":"IFERROR(VLOOKUP($A6,$S:$AD,6,FALSE),\"\")","v":""},{"$f":"IF(IFERROR(VLOOKUP($A6,$S:$AD,7,FALSE),\"\")=0,\"\",IFERROR(VLOOKUP($A6,$S:$AD,7,FALSE),\"\"))","v":""},{"$f":"IF(IFERROR(VLOOKUP($A6,$S:$AD,8,FALSE),\"\")=0,\"\",IFERROR(VLOOKUP($A6,$S:$AD,8,FALSE),\"\"))","v":""},{"$f":"IF(IFERROR(VLOOKUP($A6,$S:$AD,9,FALSE),\"\")=0,\"\",IFERROR(VLOOKUP($A6,$S:$AD,9,FALSE),\"\"))","v":""},null,{"$f":"IF(I6=\"\",\"\",\"選択済\")","v":""},null,{"$f":"IFERROR(VLOOKUP($A6,$S:$AD,10,FALSE),\"\")","v":""},{"$f":"IFERROR(VLOOKUP($A6,$S:$AD,11,FALSE),\"\")","v":""},{"$f":"IFERROR(VLOOKUP($A6,$S:$AD,12,FALSE),\"\")","v":""},{"$f":"IF(I6=\"\",IF(M6=\"\",\"\",IF(システムフロー作成用情報登録!$B$8-$B$3<>1,\"○\",IF(ISERROR(MATCH(M6,システムフロー作成用情報登録!K:K,0))=TRUE,\"\",\"○\"))),IF(ISERROR(MATCH(I6,システムフロー作成用情報登録!K:K,0))=TRUE,\"\",\"○\"))","v":""},{"$f":"IFERROR(VLOOKUP($A6,$S:$AF,13,FALSE),\"\")","v":""},{"$f":"IFERROR(VLOOKUP($A6,$S:$AF,14,FALSE),\"\")","v":""},null,{"$f":"IF(W6=\"DISK-OUT\",IF(W5<>W6,1,S5+1),\"\")","v":""},{"$f":"$B$3&\"-\"&U6","v":"0-1"},1,{"$f":"IFERROR(VLOOKUP($T6,STEP_ALL!$A:$AH,4,FALSE),\"\")","v":""},{"$f":"IFERROR(VLOOKUP($T6,STEP_ALL!$A:$AH,5,FALSE),\"\")","v":""},{"$f":"IFERROR(VLOOKUP($T6,STEP_ALL!$A:$AH,6,FALSE),\"\")","v":""},{"$f":"IFERROR(VLOOKUP($T6,STEP_ALL!$A:$AH,7,FALSE),\"\")","v":""},{"$f":"IFERROR(VLOOKUP($T6,STEP_ALL!$A:$AH,8,FALSE),\"\")","v":""},{"$f":"IFERROR(VLOOKUP($T6,STEP_ALL!$A:$AH,9,FALSE),\"\")","v":""},{"$f":"IF(IFERROR(VLOOKUP($T6,STEP_ALL!$A:$AH,30,FALSE),\"\")=0,\"\",IFERROR(VLOOKUP($T6,STEP_ALL!$A:$AH,30,FALSE),\"\"))","v":""},{"$f":"IF(IFERROR(VLOOKUP($T6,STEP_ALL!$A:$AH,31,FALSE),\"\")=0,\"\",IFERROR(VLOOKUP($T6,STEP_ALL!$A:$AH,31,FALSE),\"\"))","v":""},{"$f":"IFERROR(MATCH(T6,STEP_ALL!A:A,0),\"\")","v":""},{"$f":"IF(IFERROR(VLOOKUP($T6,STEP_ALL!$A:$AK,36,FALSE),\"\")=0,\"\",IFERROR(VLOOKUP($T6,STEP_ALL!$A:$AK,36,FALSE),\"\"))","v":""},{"$f":"IF(IFERROR(VLOOKUP($T6,STEP_ALL!$A:$AK,37,FALSE),\"\")=0,\"\",IFERROR(VLOOKUP($T6,STEP_ALL!$A:$AK,37,FALSE),\"\"))","v":""}]
{"$rows_left_out":50}
{"sheet":"作業","index":3,"n_rows":57,"n_cols":77,"rows_kept":57,"cut":false,"hidden":true,"merged":[[4,50,4,51],[3,9,4,9],[3,10,4,10],[0,0,0,2],[0,3,0,4],[1,0,1,2],[1,3,1,4],[3,8,4,8],[3,0,4,0],[3,1,4,1],[3,2,4,2],[3,4,4,4],[0,6,0,7],[1,6,1,7],[4,44,4,45],[4,46,4,47],[4,48,4,49],[3,11,4,11],[3,12,4,12],[3,13,3,16],[3,32,4,32],[3,33,4,33],[3,28,3,31],[3,17,3,19],[3,20,3,23],[3,24,3,27]]}
["会社名",null,null,"システム名",null,"サブシステム名","機能名・他",null,"作成者",null,"step_all","開始行","行数","終了行"]
[{"$f":"IF(STEP_ALL!A2=\"\",\"\",STEP_ALL!A2)","v":""},null,null,{"$f":"IF(STEP_ALL!D2=\"\",\"\",STEP_ALL!D2)","v":""},null,{"$f":"IF(STEP_ALL!F2=\"\",\"\",STEP_ALL!F2)","v":""},{"$f":"IF(STEP_ALL!H2=\"\",\"\",STEP_ALL!H2)","v":""},null,{"$f":"IF(STEP_ALL!I2=\"\",\"\",STEP_ALL!I2)","v":""},null,4,{"$f":"IFERROR(MATCH(A6,STEP_ALL!A:A,0),0)","v":0},{"$f":"IF(L2=0,0,COUNTIF(E:E,\">\"\"\"\"\")-1)","v":0},{"$f":"IF(M2=0,0,L2+M2-1)","v":0},null,null,null,null,null,null,null,null,null,null,null,null,null,null,null,null,null,null,null,null,null,null,null,null,null,null,null,"ファイル制限数"]
[null,null,null,null,null,null,null,null,null,null,null,null,null,null,null,null,null,null,null,null,null,null,null,null,null,null,null,null,null,null,null,null,null,null,null,null,null,null,null,null,null,50]
["検索キー","STEP","№","開始行","媒体","PG内容","PG名","その他情報","備考2","I/O","定義順","区切","段目","縦",null,null,null,"PG縦",null,null,"横",null,null,null,"引継(OUT)",null,null,null,"引継(IN)",null,null,null,"引継","１段目",null,null,null,null,null,null,null,null,null,null,null,null,null,null,null,null,null,null,null,null,null,null,null,null,null,null,null,null,null,null,null,null,null,null,null,null,null,null,2]
[null,null,null,"アクセス名",null,"ファイル名","MED名","備考1",null,null,null,null,null,"位置","縦ｻｲｽﾞ","下位置","最下位","位置","縦ｻｲｽﾞ","下位置","位置","横ｻｲｽﾞ","基準位置","移動値","STEP","№","キー","相手行","STEP","№","キー","相手行",null,null,null,null,null,null,null,null,null,{"$f":"\"作業!AP8:AP\"&COUNTA(AP8:AP16)+7","v":"作業!AP8:AP12"},null,null,"サイズ",null,"標準位置",null,"移動幅",null,"順位"]
[{"$f":"B6&\"-\"&C6","v":"1-0"},{"$f":"システムフロー作成用情報登録!B8","v":1},0,{"$f":"IF(IFERROR(VLOOKUP($A6,STEP_ALL!$A:$AH,COLUMN(),FALSE),\"\")=0,\"\",IFERROR(VLOOKUP($A6,STEP_ALL!$A:$AH,COLUMN(),FALSE),\"\"))","v":""},{"$f":"IF(IFERROR(VLOOKUP($A6,STEP_ALL!$A:$AH,COLUMN(),FALSE),\"\")=0,\"\",IFERROR(VLOOKUP($A6,STEP_ALL!$A:$AH,COLUMN(),FALSE),\"\"))","v":""},{"$f":"IF(IFERROR(VLOOKUP($A6,STEP_ALL!$A:$AH,COLUMN(),FALSE),\"\")=0,\"\",IFERROR(VLOOKUP($A6,STEP_ALL!$A:$AH,COLUMN(),FALSE),\"\"))","v":""},{"$f":"IF(IFERROR(VLOOKUP($A6,STEP_ALL!$A:$AH,COLUMN(),FALSE),\"\")=0,\"\",IFERROR(VLOOKUP($A6,STEP_ALL!$A:$AH,COLUMN(),FALSE),\"\"))","v":""},{"$f":"IF(IFERROR(VLOOKUP($A6,STEP_ALL!$A:$AH,COLUMN(),FALSE),\"\")=0,\"\",IFERROR(VLOOKUP($A6,STEP_ALL!$A:$AH,COLUMN(),FALSE),\"\"))","v":""},{"$f":"IF(IFERROR(VLOOKUP($A6,STEP_ALL!$A:$AH,COLUMN(),FALSE),\"\")=0,\"\",IFERROR(VLOOKUP($A6,STEP_ALL!$A:$AH,COLUMN(),FALSE),\"\"))","v":""},{"$f":"IF(IFERROR(VLOOKUP($A6,STEP_ALL!$A:$AH,COLUMN(),FALSE),\"\")=0,\"\",IFERROR(VLOOKUP($A6,STEP_ALL!$A:$AH,COLUMN(),FALSE),\"\"))","v":""},{"$f":"IF(IFERROR(VLOOKUP($A6,STEP_ALL!$A:$AH,COLUMN(),FALSE),\"\")=0,\"\",IFERROR(VLOOKUP($A6,STEP_ALL!$A:$AH,COLUMN(),FALSE),\"\"))","v":""},{"$f":"IF(IFERROR(VLOOKUP($A6,STEP_ALL!$A:$AH,COLUMN(),FALSE),\"\")=0,\"\",IFERROR(VLOOKUP($A6,STEP_ALL!$A:$AH,COLUMN(),FALSE),\"\"))","v":""},{"$f":"IF(IFERROR(VLOOKUP($A6,STEP_ALL!$A:$AH,COLUMN(),FALSE),\"\")=0,\"\",IFERROR(VLOOKUP($A6,STEP_ALL!$A:$AH,COLUMN(),FALSE),\"\"))","v":""},{"$f":"IF(IFERROR(VLOOKUP($A6,STEP_ALL!$A:$AH,COLUMN(),FALSE),\"\")=0,\"\",IFERROR(VLOOKUP($A6,STEP_ALL!$A:$AH,COLUMN(),FALSE),\"\"))","v":""},{"$f":"IF(IFERROR(VLOOKUP($A6,STEP_ALL!$A:$AH,COLUMN(),FALSE),\"\")=0,\"\",IFERROR(VLOOKUP($A6,STEP_ALL!$A:$AH,COLUMN(),FALSE),\"\"))","v":""},{"$f":"IF(IFERROR(VLOOKUP($A6,STEP_ALL!$A:$AH,COLUMN(),FALSE),\"\")=0,\"\",IFERROR(VLOOKUP($A6,STEP_ALL!$A:$AH,COLUMN(),FALSE),\"\"))","v":""},{"$f":"IF(IFERROR(VLOOKUP($A6,STEP_ALL!$A:$AH,COLUMN(),FALSE),\"\")=0,\"\",IFERROR(VLOOKUP($A6,STEP_ALL!$A:$AH,COLUMN(),FALSE),\"\"))","v":""},{"$f":"IF(IFERROR(VLOOKUP($A6,STEP_ALL!$A:$AH,COLUMN(),FALSE),\"\")=0,\"\",IFERROR(VLOOKUP($A6,STEP_ALL!$A:$AH,COLUMN(),FALSE),\"\"))","v":""},{"$f":"IF(IFERROR(VLOOKUP($A6,STEP_ALL!$A:$AH,COLUMN(),FALSE),\"\")=0,\"\",IFERROR(VLOOKUP($A6,STEP_ALL!$A:$AH,COLUMN(),FALSE),\"\"))","v":""},{"$f":"IF(IFERROR(VLOOKUP($A6,STEP_ALL!$A:$AH,COLUMN(),FALSE),\"\")=0,\"\",IFERROR(VLOOKUP($A6,STEP_ALL!$A:$AH,COLUMN(),FALSE),\"\"))","v":""},{"$f":"IF(IFERROR(VLOOKUP($A6,STEP_ALL!$A:$AH,COLUMN(),FALSE),\"\")=0,\"\",IFERROR(VLOOKUP($A6,STEP_ALL!$A:$AH,COLUMN(),FALSE),\"\"))","v":""},{"$f":"IF(IFERROR(VLOOKUP($A6,STEP_ALL!$A:$AH,COLUMN(),FALSE),\"\")=0,\"\",IFERROR(VLOOKUP($A6,STEP_ALL!$A:$AH,COLUMN(),FALSE),\"\"))","v":""},{"$f":"IF(IFERROR(VLOOKUP($A6,STEP_ALL!$A:$AH,COLUMN(),FALSE),\"\")=0,\"\",IFERROR(VLOOKUP($A6,STEP_ALL!$A:$AH,COLUMN(),FALSE),\"\"))","v":""},{"$f":"IF(IFERROR(VLOOKUP($A6,STEP_ALL!$A:$AH,COLUMN(),FALSE),\"\")=0,\"\",IFERROR(VLOOKUP($A6,STEP_ALL!$A:$AH,COLUMN(),FALSE),\"\"))","v":""},{"$f":"IF(IFERROR(VLOOKUP($A6,STEP_ALL!$A:$AH,COLUMN(),FALSE),\"\")=0,\"\",IFERROR(VLOOKUP($A6,STEP_ALL!$A:$AH,COLUMN(),FALSE),\"\"))","v":""},{"$f":"IF(IFERROR(VLOOKUP($A6,STEP_ALL!$A:$AH,COLUMN(),FALSE),\"\")=0,\"\",IFERROR(VLOOKUP($A6,STEP_ALL!$A:$AH,COLUMN(),FALSE),\"\"))","v":""},{"$f":"IF(IFERROR(VLOOKUP($A6,STEP_ALL!$A:$AH,COLUMN(),FALSE),\"\")=0,\"\",IFERROR(VLOOKUP($A6,STEP_ALL!$A:$AH,COLUMN(),FALSE),\"\"))","v":""},{"$f":"IF(IFERROR(VLOOKUP($A6,STEP_ALL!$A:$AH,COLUMN(),FALSE),\"\")=0,\"\",IFERROR(VLOOKUP($A6,STEP_ALL!$A:$AH,COLUMN(),FALSE),\"\"))","v":""},{"$f":"IF(IFERROR(VLOOKUP($A6,STEP_ALL!$A:$AH,COLUMN(),FALSE),\"\")=0,\"\",IFERROR(VLOOKUP($A6,STEP_ALL!$A:$AH,COLUMN(),FALSE),\"\"))","v":""},{"$f":"IF(IFERROR(VLOOKUP($A6,STEP_ALL!$A:$AH,COLUMN(),FALSE),\"\")=0,\"\",IFERROR(VLOOKUP($A6,STEP_ALL!$A:$AH,COLUMN(),FALSE),\"\"))","v":""},{"$f":"IF(IFERROR(VLOOKUP($A6,STEP_ALL!$A:$AH,COLUMN(),FALSE),\"\")=0,\"\",IFERROR(VLOOKUP($A6,STEP_ALL!$A:$AH,COLUMN(),FALSE),\"\"))","v":""},{"$f":"IF(IFERROR(VLOOKUP($A6,STEP_ALL!$A:$AH,COLUMN(),FALSE),\"\")=0,\"\",IFERROR(VLOOKUP($A6,STEP_ALL!$A:$AH,COLUMN(),FALSE),\"\"))","v":""},{"$f":"IF(IFERROR(VLOOKUP($A6,STEP_ALL!$A:$AH,COLUMN(),FALSE),\"\")=0,\"\",IFERROR(VLOOKUP($A6,STEP_ALL!$A:$AH,COLUMN(),FALSE),\"\"))","v":""},{"$f":"IF(IFERROR(VLOOKUP($A6,STEP_ALL!$A:$AH,COLUMN(),FALSE),\"\")=0,\"\",IFERROR(VLOOKUP($A6,STEP_ALL!$A:$AH,COLUMN(),FALSE),\"\"))","v":""},null,null,null,null,null,null,null,"種別","種別","標準図形名","縦","横","縦移動","横","縦","横","IO","種別"]
{"$rows_left_out":52}
{"sheet":"標準ファイル名称","index":4,"n_rows":33,"n_cols":7,"rows_kept":33,"cut":false,"hidden":false,"merged":[[1,2,1,3]]}
[]
[null,null,"【標準ファイル名称】"]
[]
[null,null,"アクセス名","標準ファイル名称",null,"アクセス名","標準ファイル名称"]
[null,1,null,null,null,"CHIKULF",{"$f":"IFERROR(VLOOKUP(F5,C:D,2,FALSE),\"\")","v":""}]
[null,{"$f":"B5+1","v":2}]
{"$rows_left_out":28}
{"sheet":"STEP_ALL","index":5,"n_rows":5,"n_cols":85,"rows_kept":5,"cut":false,"hidden":false,"merged":[[3,35,3,36],[3,34,4,34],[0,0,0,2],[1,0,1,2],[0,3,0,4],[1,3,1,4],[3,0,4,0],[3,1,4,1],[3,2,4,2],[3,4,4,4],[3,8,4,8],[3,11,4,11],[3,17,3,19],[3,24,3,27],[3,20,3,23],[3,9,4,9],[3,33,4,33],[3,12,4,12],[3,13,3,16],[3,10,4,10],[0,5,0,6],[1,5,1,6],[3,32,4,32],[3,28,3,31],[0,50,0,52],[0,53,0,54],[0,55,0,56],[1,50,1,52],[1,53,1,54],[1,55,1,56],[3,50,4,50],[3,51,4,51],[3,52,4,52],[3,54,4,54],[3,58,4,58],[3,59,4,59],[3,60,4,60],[3,61,4,61],[3,62,4,62],[3,63,3,66],[3,83,4,83],[3,84,4,84],[3,85,3,86],[3,67,3,69],[3,70,3,73],[3,74,3,77],[3,78,3,81],[3,82,4,82]]}
["会社名",null,null,"システム名",null,"サブシステム名",null,"機能名・他","作成者","次step",null,null,null,null,null,null,null,null,null,null,null,null,null,null,null,null,null,null,null,null,null,null,null,null,null,null,null,null,null,null,null,null,null,null,null,null,null,null,null,null,"会社名",null,null,"システム名",null,"サブシステム名",null,"機能名・他","作成者","次step"]
[null,null,null,null,null,null,null,null,null,{"$f":"MAX(B:B)+1","v":1},null,null,null,null,null,null,null,null,null,null,null,null,null,null,null,null,null,null,null,null,null,null,null,null,null,null,null,null,null,null,null,null,null,null,null,null,null,null,null,null,null,null,null,null,null,null,null,null,null,{"$f":"MAX(AZ:AZ)+1","v":1}]
[]
["検索キー","step","№","開始行","媒体","PG内容","PG名","その他作業","備考2","I/O","定義順","区切","段目","縦",null,null,null,"PG縦",null,null,"横",null,null,null,"引継(OUT先)",null,null,null,"引継(IN先)",null,null,null,"引継","１段目","DB\n最下段",null,null,null,null,null,null,null,null,null,null,null,null,null,null,null,"検索キー","step","№","開始行","媒体","PG内容","PG名","その他作業","備考2","I/O","定義順","区切","段目","縦",null,null,null,"PG縦",null,null,"横",null,null,null,"引継(OUT先)",null,null,null,"引継(IN先)",null,null,null,"引継","１段目","DB\n最下段"]
[null,null,null,"アクセス名",null,"ファイル名","FORM名","備考1",null,null,null,null,null,"位置","縦ｻｲｽﾞ","下位置","最下位","位置","縦ｻｲｽﾞ","下位置","位置","横ｻｲｽﾞ","基準位置","移動値","step","№","キー","相手行","step","№","キー","相手行",null,null,null,null,null,null,null,null,null,null,null,null,null,null,null,null,null,null,null,null,null,"アクセス名",null,"ファイル名","FORM名","備考1",null,null,null,null,null,"位置","縦ｻｲｽﾞ","下位置","最下位","位置","縦ｻｲｽﾞ","下位置","位置","横ｻｲｽﾞ","基準位置","移動値","step","№","キー","相手行","step","№","キー","相手行"]