{"text_format":"1","workbook":"xlsx","n_sheets":3,"sheets":["迷路","判定","補助"],"not_rendered":{"charts":0,"images":2,"macros":1,"external_links":0,"defined_names":0,"comments":0,"pivot_tables":0},"unopened":[],"bounds":{"document_bytes":16777216,"sheet_cells":100000,"rows_first":2000,"rows_last":500,"rows_between":2000,"halvings":0,"cell_chars":16384,"cell_head_chars":4096},"cells_cut":0,"cells_raw":0,"read":"whole","date_system":"1900"}

{"sheet":"迷路","index":0,"n_rows":33,"n_cols":59,"rows_kept":33,"cut":false,"hidden":false,"merged":[[26,1,26,8],[25,1,25,8],[13,1,13,2],[14,1,14,2],[15,1,15,2],[14,3,14,4],[13,3,13,4],[24,1,24,2],[15,3,15,4],[9,2,10,2],[5,4,6,4],[9,4,10,4],[0,9,0,58],[1,9,1,58],[0,1,0,4],[5,1,6,1],[9,1,10,1],[5,2,6,2],[3,1,3,2]]}
[null,{"$f":"NOW()","v":"2021-02-25T10:31:47.180"},null,null,null,null,null,null,null,"【迷路に挑戦！】"]
[null,null,null,null,null,null,null,null,null,{"$f":"補助!B28&\"\"","v":"※開始ボタンで挑戦を始めましょう。"}]
[]
[null,"※最大50コマまで",null,null,null,null,null,null,null,"G"]
[null,"縦コマ数","横コマ数",null,"最短移動数"]
[null,30,50,null,{"$f":"IF(補助!B31=\"\",\"\",補助!B31)","v":316}]
[]
[]
[null,"開始(S)","終了(G)",null,"実移動数"]
[null,"右下","左上",null,{"$f":"IF(補助!C31=\"\",\"\",補助!C31)","v":""}]
[]
[]
[]
[null,"開始時刻",null,{"$f":"IF(補助!B34=\"\",\"\",補助!B34)","v":""}]
[null,"終了時刻",null,{"$f":"IF(補助!C34=\"\",\"\",補助!C34)","v":""}]
[null,"所要時間",null,{"$f":"IF(D15=\"\",\"\",D15-D14)","v":""}]
[]
[]
[]
[]
[]
[]
[]
[]
[null,{"$f":"補助!B36&\"\"","v":""}]
[null,"株式会社つくばＩＴパートナー"]
[null,"Copyright © 2017 Tsukuba IT Partner Co., Ltd. All Rights Reserved."]
[]
[]
[]
[]
[]
[null,null,null,null,null,null,null,null,null,null,null,null,null,null,null,null,null,null,null,null,null,null,null,null,null,null,null,null,null,null,null,null,null,null,null,null,null,null,null,null,null,null,null,null,null,null,null,null,null,null,null,null,null,null,null,null,null,null,"S"]

{"sheet":"判定","index":1,"n_rows":33,"n_cols":59,"rows_kept":33,"cut":false,"hidden":true,"merged":[]}
[]
[]
[]
[null,null,null,null,null,null,null,null,null,1001,1001,1001,1002,1002,1002,1003,1003,1003,1003,1003,1003,1003,1004,1004,1004,1004,1004,1004,1004,1004,1004,1004,1005,1005,1005,1005,1005,1005,1006,1007,1007,1008,1004,1004,1004,1004,1009,1010,1010,1011,1011,1011,1011,1009,1009,1012,1012,1012,1013]
[null,null,null,null,null,null,null,null,null,"○",1014,1001,1001,1002,1002,1015,1003,1003,1016,1016,1016,1003,1003,1004,1004,1017,1017,1018,1018,1018,1004,1004,1019,1019,1019,1005,1005,1005,1006,1006,1007,1004,1004,1020,1020,1004,1009,1009,1010,1010,1010,1011,1011,1009,1009,1009,1021,1012,1013]
[null,null,null,null,null,null,null,null,null,"○","○","○",1001,1001,1015,1015,1003,1003,1003,1016,1016,1003,1003,1017,1017,1017,1017,1022,1018,1018,1004,1019,1019,1019,1019,1023,1023,1023,1006,1006,1007,1004,1004,1004,1004,1004,1009,1009,1010,1010,1010,1010,1010,1009,1009,1009,1021,1012,1013]
[null,null,null,null,null,null,null,null,null,"○","○","○","○",1001,"○","○",1003,1003,1003,1016,1016,1003,1003,1003,1003,1022,1022,1022,1024,1024,1004,1004,1004,1025,1023,1023,1023,1006,1006,1026,1007,1004,1004,1004,1004,1027,1009,1010,1010,1010,1010,1010,1010,1009,1009,1009,1021,1012,1012]
[null,null,null,null,null,null,null,null,null,1028,1028,1028,"○",1001,"○","○",1029,1003,1003,1016,1016,1003,1003,1003,1003,1022,1022,1030,1030,1024,1004,1004,1004,1023,1023,1023,1023,1006,1006,1026,1007,1004,1004,1004,1031,1009,1009,1009,1009,1009,1009,1009,1009,1009,1009,1009,1021,1021,1012]
[null,null,null,null,null,null,null,null,null,1028,1028,1028,"○","○","○","○","○",1032,1022,1022,1022,1022,1022,1022,1022,1022,1022,1030,1030,1024,1024,1024,1004,1023,1023,1023,1006,1006,1006,1007,1007,1004,1004,1004,1031,1009,1009,1009,1033,1033,1033,1033,1033,1012,1012,1012,1012,1021,1012]
[null,null,null,null,null,null,null,null,null,1028,1028,1028,1034,1034,1034,1034,"○",1032,1022,1022,1022,1022,1022,1022,1024,1024,1024,1024,1024,1024,1024,1024,1004,1035,1035,1035,1006,1006,1006,1007,1007,1004,1004,1004,1031,1009,1009,1033,1033,1033,1033,1033,1033,1012,1012,1012,1012,1012,1012]
[null,null,null,null,null,null,null,null,null,1028,1028,1028,1036,1034,1034,1034,"○","○","○","○","○",1022,1022,1022,1024,1024,1024,1024,1037,1037,1004,1004,1004,1038,1038,1035,1035,1035,1006,1039,1006,1006,1006,1004,1004,1004,1004,1033,1033,1033,1033,1033,1033,1040,1012,1012,1041,1012,1012]
[null,null,null,null,null,null,null,null,null,1042,1042,1036,1036,1034,1034,1034,"○","○",1043,"○","○",1022,1022,1022,1024,1024,1037,1037,1037,1037,1004,1004,1004,1004,1038,1035,1035,1035,1006,1006,1006,1044,1004,1004,1004,1004,1004,1004,1033,1033,1033,1033,1033,1033,1033,1033,1041,1012,1012]
[null,null,null,null,null,null,null,null,null,1042,1042,1036,1034,1034,1034,1034,"○","○","○","○","○","○","○","○",1037,1037,1037,1045,1046,1046,1046,1045,1045,1004,1038,1038,1038,1035,1006,1006,1044,1044,1004,1004,1004,1004,1004,1004,1047,1033,1033,1033,1033,1033,1033,1033,1041,1041,1048]
[null,null,null,null,null,null,null,null,null,1036,1036,1036,1034,1049,1049,"○","○","○","○","○","○",1050,1050,"○","○","○","○",1045,1045,1045,1045,1045,1004,1004,1004,1004,1038,1035,1035,1035,1035,1035,1035,1035,1004,1004,1004,1004,1047,1047,1047,1047,1047,1047,1033,1033,1041,1041,1048]
[null,null,null,null,null,null,null,null,null,1036,1036,1036,1034,1049,1049,"○","○","○","○","○","○",1051,"○","○","○","○","○","○","○","○",1052,1053,1004,1004,1004,1004,1038,1004,1004,1035,1035,1035,1035,1035,1004,1004,1004,1004,1054,1047,1047,1047,1047,1047,1033,1033,1033,1033,1048]
[null,null,null,null,null,null,null,null,null,1055,1056,1036,1034,1057,1057,"○","○","○","○",1058,"○","○","○","○","○","○","○","○","○","○",1052,1053,1004,1004,1004,1004,1038,1004,1004,1004,1004,1004,1004,1004,1004,1004,1004,1004,1054,1047,1047,1047,1047,1047,1059,1033,1033,1033,1048]
[null,null,null,null,null,null,null,null,null,1055,1036,1036,1034,1057,1057,"○","○","○","○","○","○","○","○",1060,"○","○","○",1052,1052,1052,1052,1052,1061,1061,1004,1004,1038,1004,1062,1063,1063,1063,1063,1004,1004,1004,1004,1004,1054,1047,1047,1047,1047,1047,1059,1033,1033,1033,1048]
[null,null,null,null,null,null,null,null,null,1055,1036,1036,1034,1034,1064,1064,1064,1034,1034,1065,1065,1065,"○",1060,"○","○","○",1052,1052,1052,1066,1052,1061,1061,1067,1004,1004,1004,1062,1062,1062,1062,1063,1063,1063,1063,1063,1063,1054,1047,1047,1047,1047,1059,1059,1033,1033,1048,1048]
[null,null,null,null,null,null,null,null,null,1036,1036,1036,1068,1034,1034,1034,1034,1034,1034,1069,"○","○","○",1060,"○","○","○",1052,1052,1052,1052,1052,1061,1067,1067,1067,1070,1070,1062,1062,1062,1062,1063,1063,1054,1054,1063,1063,1054,1054,1047,1047,1047,1059,1033,1033,1033,1048,1048]
[null,null,null,null,null,null,null,null,null,1036,1036,1036,1036,1036,1036,1034,1034,1034,1034,1069,"○","○",1060,1060,"○",1071,"○",1052,1052,1052,1052,1072,1061,1067,1067,1067,1067,1067,1054,1054,1054,1054,1063,1063,1054,1054,1054,1054,1073,1054,1074,1059,1059,1059,1033,1033,1033,1048,1048]
[null,null,null,null,null,null,null,null,null,1036,1036,1036,1036,1075,1036,1036,"○","○",1069,1069,"○","○","○","○","○","○","○",1076,1076,1072,1072,1072,1061,1077,1067,1067,1067,1067,1054,1054,1054,1054,1063,1063,1054,1054,1078,1054,1073,1054,1074,1059,1059,1059,1059,1079,1079,1048,1048]
[null,null,null,null,null,null,null,null,null,1036,1080,1080,1036,1036,1036,1036,"○","○","○","○","○","○","○",1081,1081,"○",1076,1076,1076,1072,1072,1072,1061,1077,1077,1077,1067,1067,1054,1054,1054,1054,1054,1054,1054,1054,1078,1054,1073,1054,1074,1059,1059,1059,1059,1082,1048,1048,1048]
[null,null,null,null,null,null,null,null,null,1036,1036,1080,1036,1036,"○","○","○","○","○","○","○","○","○",1083,"○","○",1076,1076,1076,1076,1072,1072,1061,1061,1061,1077,1077,1061,1061,1061,1061,1061,1061,1078,1078,1078,1078,1054,1054,1054,1074,1084,1084,1059,1059,1059,1048,1085,1048]
[null,null,null,null,null,null,null,null,null,1086,1036,1036,1036,"○","○",1087,1087,1088,1088,1088,1088,1089,"○","○","○",1090,1090,1076,1076,1076,1076,1076,1061,1061,1061,1061,1061,1061,1061,1061,1061,1061,1061,1078,1078,1078,1091,1054,1054,1092,1074,1074,1084,1059,1059,1059,1048,1048,1048]
[null,null,null,null,null,null,null,null,null,1086,1086,"○","○","○","○",1093,1087,1088,1088,1094,1088,1088,1088,1095,1095,1095,"○","○","○",1076,1076,1076,1061,1061,1096,1096,1096,1096,1061,1061,1061,1061,1061,1078,1078,1078,1078,1097,1074,1074,1074,1074,1059,1059,1059,1059,1059,1098,1098]
[null,null,null,null,null,null,null,null,null,"○","○","○","○","○","○","○",1087,1099,1099,"○","○","○",1088,"○","○","○","○",1100,"○","○",1101,1076,1076,1076,1096,1096,1096,1096,1096,1096,1102,1061,1061,1078,1078,1078,1078,1097,1074,1074,1074,1074,1059,1103,1059,1059,1059,1059,1098]
[null,null,null,null,null,null,null,null,null,"○","○",1104,1104,"○","○","○",1087,1099,1099,"○","○","○","○","○",1105,1105,1106,1100,"○","○",1101,1076,1076,1076,1096,1096,1096,1096,1096,1096,"○","○",1078,1078,1107,1097,1097,1097,1108,1074,1074,1059,1059,1103,1059,1059,1059,1059,1098]
[null,null,null,null,null,null,null,null,null,1109,"○","○",1104,"○","○",1110,1087,1087,1087,1087,"○",1105,1105,1105,1105,1105,1100,1100,"○","○","○","○","○","○","○","○",1111,1111,"○","○","○","○","○",1107,1107,1097,1097,1097,1097,1112,1112,1059,1059,1059,1059,1059,1059,1098,1098]
[null,null,null,null,null,null,null,null,null,1109,1109,"○",1104,"○","○",1110,1110,1110,1110,1087,"○",1105,1105,1105,1105,1105,1100,1100,1100,1100,"○","○","○","○","○","○","○","○","○",1113,1113,"○","○","○","○",1097,1097,1097,1097,1097,1112,1112,1112,1112,1112,1059,1059,1098,1098]
[null,null,null,null,null,null,null,null,null,"○","○","○",1104,"○","○","○",1114,1087,1087,1087,"○",1115,1105,1105,1116,1116,1116,1116,1100,1100,"○",1117,"○",1118,"○","○","○","○","○",1119,"○","○","○","○","○",1097,1097,1097,1097,1097,1120,"○","○",1112,1112,1059,1059,1121,1098]
[null,null,null,null,null,null,null,null,null,"○","○","○","○","○",1122,"○",1114,1087,"○","○","○","○",1105,1105,1123,1116,1116,1116,1124,"○","○",1117,"○","○","○","○","○",1125,1125,1119,"○","○","○","○","○","○","○",1097,1097,"○","○","○","○","○",1126,1126,1098,1098,1098]
[null,null,null,null,null,null,null,null,null,"○",1127,1127,"○","○","○","○","○",1087,"○","○",1128,"○",1123,1123,1123,1116,1116,1124,1124,"○","○","○","○","○","○","○",1129,1119,1119,1119,1130,"○","○","○",1131,"○","○","○","○","○","○","○","○","○","○","○",1098,1098,1098]
[null,null,null,null,null,null,null,null,null,"○","○","○","○","○","○",1132,"○","○","○","○","○","○",1123,1123,1133,1116,1116,1124,1124,"○","○","○","○",1119,1119,1119,1119,1119,1134,1134,1130,1130,"○","○",1131,"○","○","○","○","○","○","○","○","○","○","○","○","○","○"]

{"sheet":"補助","index":2,"n_rows":2503,"n_cols":20,"rows_kept":2503,"cut":false,"hidden":true,"merged":[[1,18,1,19],[1,10,1,16],[20,1,20,3],[1,6,1,8],[2,12,2,13],[2,14,2,15],[8,1,8,3],[12,1,12,3],[16,1,16,3]]}
[null,null,null,null,null,null,null,null,null,null,{"$f":"COUNTIF(L:L,0)","v":0}]
[null,null,null,null,null,null,"順路",null,null,null,"空領域",null,null,null,null,null,null,null,"現在位置"]
[null,null,"縦","横",null,"順","縦","横","向",null,"領域番号","連結","開始",null,"終了",null,"ｺﾏ数",null,"縦","横"]
[{"$f":"IF(迷路!$B$10=B4,A3,A3+1)","v":1},"左上",{"$f":"ROW(迷路!K4)","v":4},{"$f":"COLUMN(迷路!J4)","v":10},null,1,33,58,"←",null,1001,1,4,10,8,14,9,null,33,59]
[{"$f":"IF(迷路!$B$10=B5,A4,A4+1)","v":2},"右上",{"$f":"C4","v":4},{"$f":"D4+C11-1","v":59},null,{"$f":"F4+1","v":2},33,57,"←",null,1002,1,4,13,5,15,5]
[{"$f":"IF(迷路!$B$10=B6,A5,A5+1)","v":2},"右下",{"$f":"C4+B11-1","v":33},{"$f":"D5","v":59},null,{"$f":"F5+1","v":3},33,56,"↑",null,1003,1,4,16,8,25,29]
[{"$f":"IF(迷路!$B$10=B7,A6,A6+1)","v":3},"左下",{"$f":"C6","v":33},{"$f":"D4","v":10},null,4,32,56,"←",null,1004,1,4,23,18,38,116]
[null,null,null,null,null,5,32,55,"↓",null,1005,1,4,33,5,38,9]
[null,"縦横マス数",null,null,null,6,33,55,"←",null,1006,1,4,39,13,40,24]
[null,"縦","横","総マス",null,7,33,54,"←",null,1007,1,4,40,10,41,10]
[null,{"$f":"迷路!B6","v":30},{"$f":"迷路!C6","v":50},{"$f":"B11*C11","v":1500},null,8,33,53,"↑",null,1008,1,4,42,4,42,1]
[null,null,null,null,null,9,32,53,"→",null,1009,1,4,47,10,47,33]
[null,"開始",null,null,null,10,32,54,"↑",null,1010,1,4,48,7,53,16]
[null,"位置","縦","横",null,11,31,54,"←",null,1011,1,4,50,5,53,6]
[null,{"$f":"迷路!B10","v":"右下"},{"$f":"VLOOKUP($B15,補助!$B$4:$D$7,2,FALSE)","v":33},{"$f":"VLOOKUP($B15,補助!$B$4:$D$7,3,FALSE)","v":59},null,12,31,53,"↑",null,1012,1,4,56,12,59,25]
[null,null,null,null,null,13,30,53,"←",null,1013,1,4,59,6,59,3]
[null,"終了",null,null,null,14,30,52,"↓",null,1014,1,5,11,5,11,1]
[null,"位置","縦","横",null,15,31,52,"↓",null,1015,1,5,16,6,16,3]
[null,{"$f":"迷路!C10","v":"左上"},{"$f":"VLOOKUP($B19,補助!$B$4:$D$7,2,FALSE)","v":4},{"$f":"VLOOKUP($B19,補助!$B$4:$D$7,3,FALSE)","v":10},null,16,32,52,"↓",null,1016,1,5,19,8,21,9]
[null,null,null,null,null,17,33,52,"←",null,1017,1,5,26,6,27,6]
[null,"枠終了",null,null,null,18,33,51,"↑",null,1018,1,5,28,6,30,5]
[null,"位置","縦","横",null,19,32,51,"↑",null,1019,1,5,33,6,35,7]
[null,"右下",{"$f":"VLOOKUP($B23,補助!$B$4:$D$7,2,FALSE)","v":33},{"$f":"VLOOKUP($B23,補助!$B$4:$D$7,3,FALSE)","v":59},null,20,31,51,"←",null,1020,1,5,44,5,45,2]
[null,null,null,null,null,21,31,50,"↓",null,1021,1,5,57,9,58,6]
[null,"領域番号","連結",null,null,22,32,50,"↓",null,1022,1,6,28,12,24,27]
[null,1119,{"$f":"IF(ISNUMBER(B26)=FALSE,1,IFERROR(VLOOKUP(B26,K:L,2,FALSE),\"\"))","v":1},null,null,23,33,50,"←",null,1023,1,6,36,9,36,13]
[null,null,null,null,null,24,33,49,"↑",null,1024,1,7,29,12,26,20]
[null,"※開始ボタンで挑戦を始めましょう。",null,null,null,25,32,49,"←",null,1025,1,7,34,7,34,1]
[null,null,null,null,null,26,32,48,"↓",null,1026,1,7,40,8,40,2]
[null,"正解移動数","実移動数",null,null,27,33,48,"←",null,1027,1,7,46,7,46,1]
[null,316,null,null,null,28,33,47,"←",null,1028,1,8,10,11,12,12]
[null,null,null,null,null,29,33,46,"↑",null,1029,1,8,17,8,17,1]
[null,"開始時間","終了時間",null,null,30,32,46,"→",null,1030,1,8,28,9,29,4]
[null,null,null,null,null,31,32,47,"↑",null,1031,1,8,45,10,45,3]
[null,null,null,null,null,32,31,47,"←",null,1032,1,9,18,10,18,2]
[null,null,null,null,null,33,31,46,"←",null,1033,1,9,49,20,57,52]
[null,null,null,null,null,34,31,45,"↑",null,1034,1,10,13,20,19,32]
[1,{"$f":"VLOOKUP(A38,$A$4:$B$7,2,FALSE)","v":"左上"},null,null,null,35,30,45,"↑",null,1035,1,10,34,15,44,22]
[2,{"$f":"VLOOKUP(A39,$A$4:$B$7,2,FALSE)","v":"右上"},null,null,null,36,29,45,"←",null,1036,1,11,13,24,13,42]
[3,"左下",null,null,null,37,29,44,"↓",null,1037,1,11,29,13,27,9]
[null,null,null,null,null,38,30,44,"←",null,1038,1,11,34,17,37,10]
[null,false,null,null,null,39,30,43,"↓",null,1039,1,11,40,11,40,1]
[null,null,null,null,null,40,31,43,"→",null,1040,1,11,54,11,54,1]
[null,null,null,null,null,41,31,44,"↓",null,1041,1,11,57,14,58,6]
[null,null,null,null,null,42,32,44,"↓",null,1042,1,12,10,13,11,4]
[null,null,null,null,null,43,33,44,"←",null,1043,1,12,19,12,19,1]
[null,null,null,null,null,44,33,43,"↑",null,1044,1,12,42,13,42,3]
[null,null,null,null,null,45,32,43,"←",null,1045,1,13,28,14,32,8]
[null,null,null,null,null,46,32,42,"↑",null,1046,1,13,29,13,31,3]
[null,null,null,null,null,47,31,42,"←",null,1047,1,13,49,19,53,29]
[null,null,null,null,null,48,31,41,"↑",null,1048,1,13,59,24,59,21]
[null,null,null,null,null,49,30,41,"→",null,1049,1,14,14,15,15,4]
[null,null,null,null,null,50,30,42,"↑",null,1050,1,14,22,14,23,2]
[null,null,null,null,null,51,29,42,"→",null,1051,1,15,22,15,22,1]
[null,null,null,null,null,52,29,43,"↑",null,1052,1,15,31,20,31,20]
[null,null,null,null,null,53,28,43,"←",null,1053,1,15,32,16,32,2]
[null,null,null,null,null,54,28,42,"↑",null,1054,1,15,49,24,49,40]
[null,null,null,null,null,55,27,42,"←",null,1055,1,16,10,18,10,3]
[null,null,null,null,null,56,27,41,"↓",null,1056,1,16,11,16,11,1]
[null,null,null,null,null,57,28,41,"←",null,1057,1,16,14,17,15,4]
[null,null,null,null,null,58,28,40,"←",null,1058,1,16,20,16,20,1]
[null,null,null,null,null,59,28,39,"↓",null,1059,1,16,55,30,57,48]
[null,null,null,null,null,60,29,39,"↓",null,1060,1,17,24,20,24,5]
[null,null,null,null,null,61,30,39,"←",null,1061,1,17,33,26,43,37]
[null,null,null,null,null,62,30,38,"↑",null,1062,1,17,39,19,42,9]
[null,null,null,null,null,63,29,38,"←",null,1063,1,17,40,21,44,18]
[null,null,null,null,null,64,29,37,"←",null,1064,1,18,15,18,17,3]
[null,null,null,null,null,65,29,36,"↑",null,1065,1,18,20,18,22,3]
[null,null,null,null,null,66,28,36,"←",null,1066,1,18,31,18,31,1]
[null,null,null,null,null,{"$f":"F69+1","v":67},28,35,"↓",null,1067,1,18,35,22,38,15]
[null,null,null,null,null,68,29,35,"←",null,1068,1,19,13,19,13,1]
[null,null,null,null,null,69,29,34,"↑",null,1069,1,19,20,21,20,4]
[null,null,null,null,null,70,28,34,"←",null,1070,1,19,37,19,38,2]
[null,null,null,null,null,71,28,33,"↓",null,1071,1,20,26,20,26,1]
[null,null,null,null,null,72,29,33,"↓",null,1072,1,20,32,23,32,9]
[null,null,null,null,null,73,30,33,"↓",null,1073,1,20,49,22,49,3]
[null,null,null,null,null,74,31,33,"→",null,1074,1,20,51,27,51,16]
[null,null,null,null,null,75,31,34,"→",null,1075,1,21,14,21,14,1]
[null,null,null,null,null,76,31,35,"↑",null,1076,1,21,28,27,34,23]
[null,null,null,null,null,77,30,35,"→",null,1077,1,21,34,23,37,6]
[null,null,null,null,null,78,30,36,"→",null,1078,1,21,47,27,44,19]
[null,null,null,null,null,79,30,37,"↓",null,1079,1,21,56,21,57,2]
[null,null,null,null,null,80,31,37,"←",null,1080,1,22,11,23,12,3]
[null,null,null,null,null,81,31,36,"↓",null,1081,1,22,24,22,25,2]
[null,null,null,null,null,82,32,36,"←",null,1082,1,22,56,22,56,1]
[null,null,null,null,null,83,32,35,"←",null,1083,1,23,24,23,24,1]
[null,null,null,null,null,84,32,34,"←",null,1084,1,23,52,24,53,3]
[null,null,null,null,null,85,32,33,"↓",null,1085,1,23,58,23,58,1]
[null,null,null,null,null,86,33,33,"←",null,1086,1,24,10,25,11,3]
[null,null,null,null,null,87,33,32,"↑",null,1087,1,24,16,32,18,15]
[null,null,null,null,null,88,32,32,"←",null,1088,1,24,18,26,23,10]
[null,null,null,null,null,89,32,31,"↓",null,1089,1,24,22,24,22,1]
[null,null,null,null,null,90,33,31,"←",null,1090,1,24,26,24,27,2]
[null,null,null,null,null,91,33,30,"↑",null,1091,1,24,47,24,47,1]
[null,null,null,null,null,92,32,30,"↑",null,1092,1,24,50,24,50,1]
[null,null,null,null,null,93,31,30,"→",null,1093,1,25,16,25,16,1]
[null,null,null,null,null,94,31,31,"↑",null,1094,1,25,20,25,20,1]
[null,null,null,null,null,95,30,31,"↑",null,1095,1,25,24,25,26,3]
[null,null,null,null,null,96,29,31,"→",null,1096,1,25,35,27,40,16]
[null,null,null,null,null,97,29,32,"↑",null,1097,1,25,48,31,49,21]
[null,null,null,null,null,98,28,32,"←",null,1098,1,25,58,32,59,15]
[null,null,null,null,null,99,28,31,"←",null,1099,1,26,18,27,19,4]
[null,null,null,null,null,100,28,30,"←",null,1100,1,26,28,30,30,10]
[null,null,null,null,null,101,28,29,"↑",null,1101,1,26,31,27,31,2]
[null,null,null,null,null,102,27,29,"→",null,1102,1,26,41,26,41,1]
[null,null,null,null,null,103,27,30,"↑",null,1103,1,26,54,27,54,2]
[null,null,null,null,null,104,26,30,"←",null,1104,1,27,12,30,13,5]
[null,null,null,null,null,105,26,29,"↑",null,1105,1,27,25,31,24,16]
[null,null,null,null,null,106,25,29,"←",null,1106,1,27,27,27,27,1]
[null,null,null,null,null,107,25,28,"←",null,1107,1,27,45,28,45,3]
[null,null,null,null,null,108,25,27,"↓",null,1108,1,27,49,27,49,1]
[null,null,null,null,null,109,26,27,"←",null,1109,1,28,10,29,11,3]
[null,null,null,null,null,110,26,26,"←",null,1110,1,28,16,29,19,5]
[null,null,null,null,null,111,26,25,"←",null,1111,1,28,37,28,38,2]
[null,null,null,null,null,112,26,24,"↓",null,1112,1,28,50,30,55,9]
[null,null,null,null,null,113,27,24,"←",null,1113,1,29,40,29,41,2]
[null,null,null,null,null,114,27,23,"←",null,1114,1,30,17,31,17,2]
[null,null,null,null,null,115,27,22,"↑",null,1115,1,30,22,30,22,1]
[null,null,null,null,null,116,26,22,"←",null,1116,1,30,25,33,27,11]
[null,null,null,null,null,117,26,21,"←",null,1117,1,30,32,31,32,2]
[null,null,null,null,null,118,26,20,"↓",null,1118,1,30,34,30,34,1]
[null,null,null,null,null,119,27,20,"→",null,1119,1,30,40,33,38,10]
[null,null,null,null,null,120,27,21,"↓",null,1120,1,30,51,30,51,1]
[null,null,null,null,null,121,28,21,"↓",null,1121,1,30,58,30,58,1]
[null,null,null,null,null,122,29,21,"↓",null,1122,1,31,15,31,15,1]
[null,null,null,null,null,123,30,21,"↓",null,1123,1,31,25,33,24,6]
[null,null,null,null,null,124,31,21,"→",null,1124,1,31,29,33,29,5]
[null,null,null,null,null,125,31,22,"↓",null,1125,1,31,38,31,39,2]
[null,null,null,null,null,126,32,22,"↓",null,1126,1,31,55,31,56,2]
[null,null,null,null,null,127,33,22,"←",null,1127,1,32,11,32,12,2]
[null,null,null,null,null,128,33,21,"←",null,1128,1,32,21,32,21,1]
[null,null,null,null,null,129,33,20,"↑",null,1129,1,32,37,32,37,1]
[null,null,null,null,null,130,32,20,"↑",null,1130,1,32,41,33,42,3]
[null,null,null,null,null,{"$f":"F133+1","v":131},31,20,"←",null,1131,1,32,45,33,45,2]
[null,null,null,null,null,132,31,19,"↓",null,1132,1,33,16,33,16,1]
[null,null,null,null,null,133,32,19,"↓",null,1133,1,33,25,33,25,1]
[null,null,null,null,null,134,33,19,"←",null,1134,1,33,39,33,40,2]
[null,null,null,null,null,135,33,18,"←"]
[null,null,null,null,null,136,33,17,"↑"]
[null,null,null,null,null,137,32,17,"←"]
[null,null,null,null,null,138,32,16,"↑"]
[null,null,null,null,null,139,31,16,"↑"]
[null,null,null,null,null,140,30,16,"←"]
[null,null,null,null,null,141,30,15,"↑"]
[null,null,null,null,null,142,29,15,"←"]
[null,null,null,null,null,143,29,14,"↓"]
[null,null,null,null,null,144,30,14,"↓"]
[null,null,null,null,null,145,31,14,"←"]
[null,null,null,null,null,146,31,13,"↓"]
[null,null,null,null,null,147,32,13,"→"]
[null,null,null,null,null,148,32,14,"→"]
[null,null,null,null,null,149,32,15,"↓"]
[null,null,null,null,null,150,33,15,"←"]
[null,null,null,null,null,151,33,14,"←"]
[null,null,null,null,null,152,33,13,"←"]
[null,null,null,null,null,153,33,12,"←"]
[null,null,null,null,null,154,33,11,"←"]
[null,null,null,null,null,155,33,10,"↑"]
[null,null,null,null,null,156,32,10,"↑"]
[null,null,null,null,null,157,31,10,"↑"]
[null,null,null,null,null,158,30,10,"→"]
[null,null,null,null,null,159,30,11,"↓"]
[null,null,null,null,null,160,31,11,"→"]
[null,null,null,null,null,161,31,12,"↑"]
[null,null,null,null,null,162,30,12,"↑"]
[null,null,null,null,null,163,29,12,"↑"]
[null,null,null,null,null,164,28,12,"←"]
[null,null,null,null,null,165,28,11,"↑"]
[null,null,null,null,null,166,27,11,"←"]
[null,null,null,null,null,167,27,10,"↑"]
[null,null,null,null,null,168,26,10,"→"]
[null,null,null,null,null,169,26,11,"→"]
[null,null,null,null,null,170,26,12,"↑"]
[null,null,null,null,null,171,25,12,"→"]
[null,null,null,null,null,172,25,13,"↓"]
[null,null,null,null,null,173,26,13,"→"]
[null,null,null,null,null,174,26,14,"↓"]
[null,null,null,null,null,175,27,14,"↓"]
[null,null,null,null,null,176,28,14,"→"]
[null,null,null,null,null,177,28,15,"↑"]
[null,null,null,null,null,178,27,15,"→"]
[null,null,null,null,null,179,27,16,"↑"]
[null,null,null,null,null,180,26,16,"←"]
[null,null,null,null,null,181,26,15,"↑"]
[null,null,null,null,null,182,25,15,"←"]
[null,null,null,null,null,183,25,14,"↑"]
[null,null,null,null,null,184,24,14,"→"]
[null,null,null,null,null,185,24,15,"↑"]
[null,null,null,null,null,186,23,15,"→"]
[null,null,null,null,null,187,23,16,"→"]
[null,null,null,null,null,188,23,17,"↑"]
[null,null,null,null,null,189,22,17,"↑"]
[null,null,null,null,null,190,21,17,"→"]
[null,null,null,null,null,191,21,18,"↓"]
[null,null,null,null,null,192,22,18,"↓"]
[null,null,null,null,null,193,23,18,"→"]
[null,null,null,null,null,194,23,19,"↑"]
[null,null,null,null,null,{"$f":"F197+1","v":195},22,19,"→"]
[null,null,null,null,null,196,22,20,"↓"]
[null,null,null,null,null,197,23,20,"→"]
{"$rows_left_out":2303}