{"text_format":"1","workbook":"xlsx","n_sheets":4,"sheets":["今日の名言","Font_List","作業","名言集"],"not_rendered":{"charts":0,"images":2,"macros":1,"external_links":0,"defined_names":0,"comments":0,"pivot_tables":0},"unopened":[],"bounds":{"document_bytes":16777216,"sheet_cells":100000,"rows_first":2000,"rows_last":500,"rows_between":2000,"halvings":0,"cell_chars":16384,"cell_head_chars":4096},"cells_cut":0,"cells_raw":0,"read":"whole","date_system":"1900"}

{"sheet":"今日の名言","index":0,"n_rows":14,"n_cols":28,"rows_kept":14,"cut":false,"hidden":false,"merged":[[23,3,23,24],[4,27,4,32],[5,27,6,32],[2,18,2,19],[2,8,2,17],[4,3,19,24],[21,3,21,24],[12,27,12,32],[13,27,13,32]]}
[]
[]
[null,null,null,null,null,null,null,null,{"$f":"TODAY()","v":"2022-05-14"},null,null,null,null,null,null,null,null,null,{"$f":"I3","v":44695}]
[]
[null,null,null,null,null,null,null,null,null,null,null,null,null,null,null,null,null,null,null,null,null,null,null,null,null,null,null,"キーワード"]
[]
[]
[]
[]
[]
[]
[]
[null,null,null,null,null,null,null,null,null,null,null,null,null,null,null,null,null,null,null,null,null,null,null,null,null,null,null,"表示書式"]
[null,null,null,null,null,null,null,null,null,null,null,null,null,null,null,null,null,null,null,null,null,null,null,null,null,null,null,"HGP行書体"]

{"sheet":"Font_List","index":1,"n_rows":1140,"n_cols":3,"rows_kept":1140,"cut":false,"hidden":true,"merged":[]}
[null,"LAPTOP-P9609JQC",{"$f":"TODAY()","v":"2022-05-14"}]
[]
[null,"【定義済フォント名一覧表】"]
[]
[null,"フォント名",{"$f":"\"Font_List!B6:B106\"","v":"Font_List!B6:B106"}]
[3,"BIZ UDPゴシック"]
[4,"BIZ UDP明朝 Medium"]
[5,"BIZ UDゴシック"]
[6,"BIZ UD明朝 Medium"]
[7,"EPSON Pゴシック W6"]
[8,"EPSON Pゴシック W7"]
[9,"EPSON ゴシック W6"]
[10,"EPSON ゴシック W7"]
[11,"EPSON 太角ゴシック体Ｂ"]
[12,"EPSON 太丸ゴシック体Ｂ"]
[13,"HGPｺﾞｼｯｸE"]
[14,"HGPｺﾞｼｯｸM"]
[15,"HGP教科書体"]
[16,"HGP行書体"]
[17,"HGP創英ﾌﾟﾚｾﾞﾝｽEB"]
[18,"HGP創英角ｺﾞｼｯｸUB"]
[19,"HGP創英角ﾎﾟｯﾌﾟ体"]
[20,"HGP明朝B"]
[21,"HGP明朝E"]
[22,"HGSｺﾞｼｯｸE"]
[23,"HGSｺﾞｼｯｸM"]
[24,"HGS教科書体"]
[25,"HGS行書体"]
[26,"HGS創英ﾌﾟﾚｾﾞﾝｽEB"]
[27,"HGS創英角ｺﾞｼｯｸUB"]
[28,"HGS創英角ﾎﾟｯﾌﾟ体"]
[29,"HGS明朝B"]
[30,"HGS明朝E"]
[31,"HGｺﾞｼｯｸE"]
[32,"HGｺﾞｼｯｸM"]
[33,"HG丸ｺﾞｼｯｸM-PRO"]
[34,"HG教科書体"]
[35,"HG行書体"]
[36,"HG正楷書体-PRO"]
[37,"HG創英ﾌﾟﾚｾﾞﾝｽEB"]
{"$rows_left_out":1101}
{"sheet":"作業","index":2,"n_rows":106,"n_cols":9,"rows_kept":106,"cut":false,"hidden":true,"merged":[]}
[]
[null,null,null,null,null,521]
["登録件数",{"$f":"COUNTA(名言集!C:C)","v":1022},{"$f":"RANDBETWEEN(1,B3)","v":571},null,null,{"$f":"IF($B$5=\"\",INDEX(名言集!C:C,$F$2),VLOOKUP($F$2,$E:$H,2,FALSE))","v":"生まれながらに才能のある者は、それを頼んで鍛錬を怠る、自惚れる。しかし、生まれつきの才能がない者は、何とか技術を身につけようと日々努力する。心構えがまるで違う。これが大事だ。"},{"$f":"IF($B$5=\"\",INDEX(名言集!D:D,$F$2),VLOOKUP($F$2,$E:$H,3,FALSE))","v":"織田信長"},{"$f":"IF($B$5=\"\",INDEX(名言集!E:E,$F$2),VLOOKUP($F$2,$E:$H,4,FALSE))","v":"戦国時代の武将、戦国大名 / 1534～1582"},{"$f":"IF($B$5=\"\",F2,VLOOKUP($F$2,$E:$I,5,FALSE))","v":521}]
["件数",{"$f":"MAX(名言集!B:B)","v":1022},{"$f":"RANDBETWEEN(1,B4)","v":230}]
["キーワード",{"$f":"今日の名言!AB6&\"\"","v":""}]
[null,null,null,null,"連番","名言","名前","経歴","行番号"]
["テスト開始",979,null,null,1,{"$f":"IF($B$5=\"\",\"\",IFERROR(VLOOKUP($E7,名言集!$B:$E,2,FALSE),\"\"))","v":""},{"$f":"IF($B$5=\"\",\"\",IFERROR(VLOOKUP($E7,名言集!$B:$E,3,FALSE),\"\"))","v":""},{"$f":"IF($B$5=\"\",\"\",IFERROR(VLOOKUP($E7,名言集!$B:$E,4,FALSE),\"\"))","v":""},{"$f":"IF(F7=\"\",\"\",IFERROR(MATCH(E7,名言集!B:B,0),\"\"))","v":""}]
[null,null,null,null,{"$f":"E7+1","v":2},{"$f":"IF($B$5=\"\",\"\",IFERROR(VLOOKUP($E8,名言集!$B:$E,2,FALSE),\"\"))","v":""},{"$f":"IF($B$5=\"\",\"\",IFERROR(VLOOKUP($E8,名言集!$B:$E,3,FALSE),\"\"))","v":""},{"$f":"IF($B$5=\"\",\"\",IFERROR(VLOOKUP($E8,名言集!$B:$E,4,FALSE),\"\"))","v":""},{"$f":"IF(F8=\"\",\"\",IFERROR(MATCH(E8,名言集!B:B,0),\"\"))","v":""}]
[null,null,null,null,{"$f":"E8+1","v":3},{"$f":"IF($B$5=\"\",\"\",IFERROR(VLOOKUP($E9,名言集!$B:$E,2,FALSE),\"\"))","v":""},{"$f":"IF($B$5=\"\",\"\",IFERROR(VLOOKUP($E9,名言集!$B:$E,3,FALSE),\"\"))","v":""},{"$f":"IF($B$5=\"\",\"\",IFERROR(VLOOKUP($E9,名言集!$B:$E,4,FALSE),\"\"))","v":""},{"$f":"IF(F9=\"\",\"\",IFERROR(MATCH(E9,名言集!B:B,0),\"\"))","v":""}]
[null,null,null,null,4,{"$f":"IF($B$5=\"\",\"\",IFERROR(VLOOKUP($E10,名言集!$B:$E,2,FALSE),\"\"))","v":""},{"$f":"IF($B$5=\"\",\"\",IFERROR(VLOOKUP($E10,名言集!$B:$E,3,FALSE),\"\"))","v":""},{"$f":"IF($B$5=\"\",\"\",IFERROR(VLOOKUP($E10,名言集!$B:$E,4,FALSE),\"\"))","v":""},{"$f":"IF(F10=\"\",\"\",IFERROR(MATCH(E10,名言集!B:B,0),\"\"))","v":""}]
[null,null,null,null,5,{"$f":"IF($B$5=\"\",\"\",IFERROR(VLOOKUP($E11,名言集!$B:$E,2,FALSE),\"\"))","v":""},{"$f":"IF($B$5=\"\",\"\",IFERROR(VLOOKUP($E11,名言集!$B:$E,3,FALSE),\"\"))","v":""},{"$f":"IF($B$5=\"\",\"\",IFERROR(VLOOKUP($E11,名言集!$B:$E,4,FALSE),\"\"))","v":""},{"$f":"IF(F11=\"\",\"\",IFERROR(MATCH(E11,名言集!B:B,0),\"\"))","v":""}]
[null,null,null,null,6,{"$f":"IF($B$5=\"\",\"\",IFERROR(VLOOKUP($E12,名言集!$B:$E,2,FALSE),\"\"))","v":""},{"$f":"IF($B$5=\"\",\"\",IFERROR(VLOOKUP($E12,名言集!$B:$E,3,FALSE),\"\"))","v":""},{"$f":"IF($B$5=\"\",\"\",IFERROR(VLOOKUP($E12,名言集!$B:$E,4,FALSE),\"\"))","v":""},{"$f":"IF(F12=\"\",\"\",IFERROR(MATCH(E12,名言集!B:B,0),\"\"))","v":""}]
[null,null,null,null,7,{"$f":"IF($B$5=\"\",\"\",IFERROR(VLOOKUP($E13,名言集!$B:$E,2,FALSE),\"\"))","v":""},{"$f":"IF($B$5=\"\",\"\",IFERROR(VLOOKUP($E13,名言集!$B:$E,3,FALSE),\"\"))","v":""},{"$f":"IF($B$5=\"\",\"\",IFERROR(VLOOKUP($E13,名言集!$B:$E,4,FALSE),\"\"))","v":""},{"$f":"IF(F13=\"\",\"\",IFERROR(MATCH(E13,名言集!B:B,0),\"\"))","v":""}]
[null,null,null,null,8,{"$f":"IF($B$5=\"\",\"\",IFERROR(VLOOKUP($E14,名言集!$B:$E,2,FALSE),\"\"))","v":""},{"$f":"IF($B$5=\"\",\"\",IFERROR(VLOOKUP($E14,名言集!$B:$E,3,FALSE),\"\"))","v":""},{"$f":"IF($B$5=\"\",\"\",IFERROR(VLOOKUP($E14,名言集!$B:$E,4,FALSE),\"\"))","v":""},{"$f":"IF(F14=\"\",\"\",IFERROR(MATCH(E14,名言集!B:B,0),\"\"))","v":""}]
[null,null,null,null,9,{"$f":"IF($B$5=\"\",\"\",IFERROR(VLOOKUP($E15,名言集!$B:$E,2,FALSE),\"\"))","v":""},{"$f":"IF($B$5=\"\",\"\",IFERROR(VLOOKUP($E15,名言集!$B:$E,3,FALSE),\"\"))","v":""},{"$f":"IF($B$5=\"\",\"\",IFERROR(VLOOKUP($E15,名言集!$B:$E,4,FALSE),\"\"))","v":""},{"$f":"IF(F15=\"\",\"\",IFERROR(MATCH(E15,名言集!B:B,0),\"\"))","v":""}]
[null,null,null,null,10,{"$f":"IF($B$5=\"\",\"\",IFERROR(VLOOKUP($E16,名言集!$B:$E,2,FALSE),\"\"))","v":""},{"$f":"IF($B$5=\"\",\"\",IFERROR(VLOOKUP($E16,名言集!$B:$E,3,FALSE),\"\"))","v":""},{"$f":"IF($B$5=\"\",\"\",IFERROR(VLOOKUP($E16,名言集!$B:$E,4,FALSE),\"\"))","v":""},{"$f":"IF(F16=\"\",\"\",IFERROR(MATCH(E16,名言集!B:B,0),\"\"))","v":""}]
[null,null,null,null,11,{"$f":"IF($B$5=\"\",\"\",IFERROR(VLOOKUP($E17,名言集!$B:$E,2,FALSE),\"\"))","v":""},{"$f":"IF($B$5=\"\",\"\",IFERROR(VLOOKUP($E17,名言集!$B:$E,3,FALSE),\"\"))","v":""},{"$f":"IF($B$5=\"\",\"\",IFERROR(VLOOKUP($E17,名言集!$B:$E,4,FALSE),\"\"))","v":""},{"$f":"IF(F17=\"\",\"\",IFERROR(MATCH(E17,名言集!B:B,0),\"\"))","v":""}]
[null,null,null,null,12,{"$f":"IF($B$5=\"\",\"\",IFERROR(VLOOKUP($E18,名言集!$B:$E,2,FALSE),\"\"))","v":""},{"$f":"IF($B$5=\"\",\"\",IFERROR(VLOOKUP($E18,名言集!$B:$E,3,FALSE),\"\"))","v":""},{"$f":"IF($B$5=\"\",\"\",IFERROR(VLOOKUP($E18,名言集!$B:$E,4,FALSE),\"\"))","v":""},{"$f":"IF(F18=\"\",\"\",IFERROR(MATCH(E18,名言集!B:B,0),\"\"))","v":""}]
[null,null,null,null,13,{"$f":"IF($B$5=\"\",\"\",IFERROR(VLOOKUP($E19,名言集!$B:$E,2,FALSE),\"\"))","v":""},{"$f":"IF($B$5=\"\",\"\",IFERROR(VLOOKUP($E19,名言集!$B:$E,3,FALSE),\"\"))","v":""},{"$f":"IF($B$5=\"\",\"\",IFERROR(VLOOKUP($E19,名言集!$B:$E,4,FALSE),\"\"))","v":""},{"$f":"IF(F19=\"\",\"\",IFERROR(MATCH(E19,名言集!B:B,0),\"\"))","v":""}]
[null,null,null,null,14,{"$f":"IF($B$5=\"\",\"\",IFERROR(VLOOKUP($E20,名言集!$B:$E,2,FALSE),\"\"))","v":""},{"$f":"IF($B$5=\"\",\"\",IFERROR(VLOOKUP($E20,名言集!$B:$E,3,FALSE),\"\"))","v":""},{"$f":"IF($B$5=\"\",\"\",IFERROR(VLOOKUP($E20,名言集!$B:$E,4,FALSE),\"\"))","v":""},{"$f":"IF(F20=\"\",\"\",IFERROR(MATCH(E20,名言集!B:B,0),\"\"))","v":""}]
[null,null,null,null,15,{"$f":"IF($B$5=\"\",\"\",IFERROR(VLOOKUP($E21,名言集!$B:$E,2,FALSE),\"\"))","v":""},{"$f":"IF($B$5=\"\",\"\",IFERROR(VLOOKUP($E21,名言集!$B:$E,3,FALSE),\"\"))","v":""},{"$f":"IF($B$5=\"\",\"\",IFERROR(VLOOKUP($E21,名言集!$B:$E,4,FALSE),\"\"))","v":""},{"$f":"IF(F21=\"\",\"\",IFERROR(MATCH(E21,名言集!B:B,0),\"\"))","v":""}]
[null,null,null,null,16,{"$f":"IF($B$5=\"\",\"\",IFERROR(VLOOKUP($E22,名言集!$B:$E,2,FALSE),\"\"))","v":""},{"$f":"IF($B$5=\"\",\"\",IFERROR(VLOOKUP($E22,名言集!$B:$E,3,FALSE),\"\"))","v":""},{"$f":"IF($B$5=\"\",\"\",IFERROR(VLOOKUP($E22,名言集!$B:$E,4,FALSE),\"\"))","v":""},{"$f":"IF(F22=\"\",\"\",IFERROR(MATCH(E22,名言集!B:B,0),\"\"))","v":""}]
[null,null,null,null,17,{"$f":"IF($B$5=\"\",\"\",IFERROR(VLOOKUP($E23,名言集!$B:$E,2,FALSE),\"\"))","v":""},{"$f":"IF($B$5=\"\",\"\",IFERROR(VLOOKUP($E23,名言集!$B:$E,3,FALSE),\"\"))","v":""},{"$f":"IF($B$5=\"\",\"\",IFERROR(VLOOKUP($E23,名言集!$B:$E,4,FALSE),\"\"))","v":""},{"$f":"IF(F23=\"\",\"\",IFERROR(MATCH(E23,名言集!B:B,0),\"\"))","v":""}]
[null,null,null,null,18,{"$f":"IF($B$5=\"\",\"\",IFERROR(VLOOKUP($E24,名言集!$B:$E,2,FALSE),\"\"))","v":""},{"$f":"IF($B$5=\"\",\"\",IFERROR(VLOOKUP($E24,名言集!$B:$E,3,FALSE),\"\"))","v":""},{"$f":"IF($B$5=\"\",\"\",IFERROR(VLOOKUP($E24,名言集!$B:$E,4,FALSE),\"\"))","v":""},{"$f":"IF(F24=\"\",\"\",IFERROR(MATCH(E24,名言集!B:B,0),\"\"))","v":""}]
[null,null,null,null,19,{"$f":"IF($B$5=\"\",\"\",IFERROR(VLOOKUP($E25,名言集!$B:$E,2,FALSE),\"\"))","v":""},{"$f":"IF($B$5=\"\",\"\",IFERROR(VLOOKUP($E25,名言集!$B:$E,3,FALSE),\"\"))","v":""},{"$f":"IF($B$5=\"\",\"\",IFERROR(VLOOKUP($E25,名言集!$B:$E,4,FALSE),\"\"))","v":""},{"$f":"IF(F25=\"\",\"\",IFERROR(MATCH(E25,名言集!B:B,0),\"\"))","v":""}]
[null,null,null,null,20,{"$f":"IF($B$5=\"\",\"\",IFERROR(VLOOKUP($E26,名言集!$B:$E,2,FALSE),\"\"))","v":""},{"$f":"IF($B$5=\"\",\"\",IFERROR(VLOOKUP($E26,名言集!$B:$E,3,FALSE),\"\"))","v":""},{"$f":"IF($B$5=\"\",\"\",IFERROR(VLOOKUP($E26,名言集!$B:$E,4,FALSE),\"\"))","v":""},{"$f":"IF(F26=\"\",\"\",IFERROR(MATCH(E26,名言集!B:B,0),\"\"))","v":""}]
[null,null,null,null,21,{"$f":"IF($B$5=\"\",\"\",IFERROR(VLOOKUP($E27,名言集!$B:$E,2,FALSE),\"\"))","v":""},{"$f":"IF($B$5=\"\",\"\",IFERROR(VLOOKUP($E27,名言集!$B:$E,3,FALSE),\"\"))","v":""},{"$f":"IF($B$5=\"\",\"\",IFERROR(VLOOKUP($E27,名言集!$B:$E,4,FALSE),\"\"))","v":""},{"$f":"IF(F27=\"\",\"\",IFERROR(MATCH(E27,名言集!B:B,0),\"\"))","v":""}]
[null,null,null,null,22,{"$f":"IF($B$5=\"\",\"\",IFERROR(VLOOKUP($E28,名言集!$B:$E,2,FALSE),\"\"))","v":""},{"$f":"IF($B$5=\"\",\"\",IFERROR(VLOOKUP($E28,名言集!$B:$E,3,FALSE),\"\"))","v":""},{"$f":"IF($B$5=\"\",\"\",IFERROR(VLOOKUP($E28,名言集!$B:$E,4,FALSE),\"\"))","v":""},{"$f":"IF(F28=\"\",\"\",IFERROR(MATCH(E28,名言集!B:B,0),\"\"))","v":""}]
[null,null,null,null,23,{"$f":"IF($B$5=\"\",\"\",IFERROR(VLOOKUP($E29,名言集!$B:$E,2,FALSE),\"\"))","v":""},{"$f":"IF($B$5=\"\",\"\",IFERROR(VLOOKUP($E29,名言集!$B:$E,3,FALSE),\"\"))","v":""},{"$f":"IF($B$5=\"\",\"\",IFERROR(VLOOKUP($E29,名言集!$B:$E,4,FALSE),\"\"))","v":""},{"$f":"IF(F29=\"\",\"\",IFERROR(MATCH(E29,名言集!B:B,0),\"\"))","v":""}]
[null,null,null,null,24,{"$f":"IF($B$5=\"\",\"\",IFERROR(VLOOKUP($E30,名言集!$B:$E,2,FALSE),\"\"))","v":""},{"$f":"IF($B$5=\"\",\"\",IFERROR(VLOOKUP($E30,名言集!$B:$E,3,FALSE),\"\"))","v":""},{"$f":"IF($B$5=\"\",\"\",IFERROR(VLOOKUP($E30,名言集!$B:$E,4,FALSE),\"\"))","v":""},{"$f":"IF(F30=\"\",\"\",IFERROR(MATCH(E30,名言集!B:B,0),\"\"))","v":""}]
[null,null,null,null,25,{"$f":"IF($B$5=\"\",\"\",IFERROR(VLOOKUP($E31,名言集!$B:$E,2,FALSE),\"\"))","v":""},{"$f":"IF($B$5=\"\",\"\",IFERROR(VLOOKUP($E31,名言集!$B:$E,3,FALSE),\"\"))","v":""},{"$f":"IF($B$5=\"\",\"\",IFERROR(VLOOKUP($E31,名言集!$B:$E,4,FALSE),\"\"))","v":""},{"$f":"IF(F31=\"\",\"\",IFERROR(MATCH(E31,名言集!B:B,0),\"\"))","v":""}]
[null,null,null,null,26,{"$f":"IF($B$5=\"\",\"\",IFERROR(VLOOKUP($E32,名言集!$B:$E,2,FALSE),\"\"))","v":""},{"$f":"IF($B$5=\"\",\"\",IFERROR(VLOOKUP($E32,名言集!$B:$E,3,FALSE),\"\"))","v":""},{"$f":"IF($B$5=\"\",\"\",IFERROR(VLOOKUP($E32,名言集!$B:$E,4,FALSE),\"\"))","v":""},{"$f":"IF(F32=\"\",\"\",IFERROR(MATCH(E32,名言集!B:B,0),\"\"))","v":""}]
[null,null,null,null,27,{"$f":"IF($B$5=\"\",\"\",IFERROR(VLOOKUP($E33,名言集!$B:$E,2,FALSE),\"\"))","v":""},{"$f":"IF($B$5=\"\",\"\",IFERROR(VLOOKUP($E33,名言集!$B:$E,3,FALSE),\"\"))","v":""},{"$f":"IF($B$5=\"\",\"\",IFERROR(VLOOKUP($E33,名言集!$B:$E,4,FALSE),\"\"))","v":""},{"$f":"IF(F33=\"\",\"\",IFERROR(MATCH(E33,名言集!B:B,0),\"\"))","v":""}]
[null,null,null,null,28,{"$f":"IF($B$5=\"\",\"\",IFERROR(VLOOKUP($E34,名言集!$B:$E,2,FALSE),\"\"))","v":""},{"$f":"IF($B$5=\"\",\"\",IFERROR(VLOOKUP($E34,名言集!$B:$E,3,FALSE),\"\"))","v":""},{"$f":"IF($B$5=\"\",\"\",IFERROR(VLOOKUP($E34,名言集!$B:$E,4,FALSE),\"\"))","v":""},{"$f":"IF(F34=\"\",\"\",IFERROR(MATCH(E34,名言集!B:B,0),\"\"))","v":""}]
[null,null,null,null,29,{"$f":"IF($B$5=\"\",\"\",IFERROR(VLOOKUP($E35,名言集!$B:$E,2,FALSE),\"\"))","v":""},{"$f":"IF($B$5=\"\",\"\",IFERROR(VLOOKUP($E35,名言集!$B:$E,3,FALSE),\"\"))","v":""},{"$f":"IF($B$5=\"\",\"\",IFERROR(VLOOKUP($E35,名言集!$B:$E,4,FALSE),\"\"))","v":""},{"$f":"IF(F35=\"\",\"\",IFERROR(MATCH(E35,名言集!B:B,0),\"\"))","v":""}]
[null,null,null,null,30,{"$f":"IF($B$5=\"\",\"\",IFERROR(VLOOKUP($E36,名言集!$B:$E,2,FALSE),\"\"))","v":""},{"$f":"IF($B$5=\"\",\"\",IFERROR(VLOOKUP($E36,名言集!$B:$E,3,FALSE),\"\"))","v":""},{"$f":"IF($B$5=\"\",\"\",IFERROR(VLOOKUP($E36,名言集!$B:$E,4,FALSE),\"\"))","v":""},{"$f":"IF(F36=\"\",\"\",IFERROR(MATCH(E36,名言集!B:B,0),\"\"))","v":""}]
[null,null,null,null,31,{"$f":"IF($B$5=\"\",\"\",IFERROR(VLOOKUP($E37,名言集!$B:$E,2,FALSE),\"\"))","v":""},{"$f":"IF($B$5=\"\",\"\",IFERROR(VLOOKUP($E37,名言集!$B:$E,3,FALSE),\"\"))","v":""},{"$f":"IF($B$5=\"\",\"\",IFERROR(VLOOKUP($E37,名言集!$B:$E,4,FALSE),\"\"))","v":""},{"$f":"IF(F37=\"\",\"\",IFERROR(MATCH(E37,名言集!B:B,0),\"\"))","v":""}]
[null,null,null,null,32,{"$f":"IF($B$5=\"\",\"\",IFERROR(VLOOKUP($E38,名言集!$B:$E,2,FALSE),\"\"))","v":""},{"$f":"IF($B$5=\"\",\"\",IFERROR(VLOOKUP($E38,名言集!$B:$E,3,FALSE),\"\"))","v":""},{"$f":"IF($B$5=\"\",\"\",IFERROR(VLOOKUP($E38,名言集!$B:$E,4,FALSE),\"\"))","v":""},{"$f":"IF(F38=\"\",\"\",IFERROR(MATCH(E38,名言集!B:B,0),\"\"))","v":""}]
[null,null,null,null,33,{"$f":"IF($B$5=\"\",\"\",IFERROR(VLOOKUP($E39,名言集!$B:$E,2,FALSE),\"\"))","v":""},{"$f":"IF($B$5=\"\",\"\",IFERROR(VLOOKUP($E39,名言集!$B:$E,3,FALSE),\"\"))","v":""},{"$f":"IF($B$5=\"\",\"\",IFERROR(VLOOKUP($E39,名言集!$B:$E,4,FALSE),\"\"))","v":""},{"$f":"IF(F39=\"\",\"\",IFERROR(MATCH(E39,名言集!B:B,0),\"\"))","v":""}]
[null,null,null,null,34,{"$f":"IF($B$5=\"\",\"\",IFERROR(VLOOKUP($E40,名言集!$B:$E,2,FALSE),\"\"))","v":""},{"$f":"IF($B$5=\"\",\"\",IFERROR(VLOOKUP($E40,名言集!$B:$E,3,FALSE),\"\"))","v":""},{"$f":"IF($B$5=\"\",\"\",IFERROR(VLOOKUP($E40,名言集!$B:$E,4,FALSE),\"\"))","v":""},{"$f":"IF(F40=\"\",\"\",IFERROR(MATCH(E40,名言集!B:B,0),\"\"))","v":""}]
{"$rows_left_out":67}
{"sheet":"名言集","index":3,"n_rows":1022,"n_cols":5,"rows_kept":1022,"cut":false,"hidden":true,"merged":[]}
[{"$f":"IFERROR(FIND(作業!$B$5,名言集!C1),IFERROR(FIND(作業!$B$5,名言集!D1),\"\"))","v":1},{"$f":"IF(A1=\"\",0,1)","v":1},"あなたの心が正しいと思うことをしなさい。どっちにしたって批判されるのだから。","エレノア・ルーズベルト","米国のファーストレディ、人権活動家 / 1884～1962"]
[{"$f":"IFERROR(FIND(作業!$B$5,名言集!C2),IFERROR(FIND(作業!$B$5,名言集!D2),\"\"))","v":1},{"$f":"IF(A2=\"\",B1,B1+1)","v":2},"前進をしない人は、後退をしているのだ。","ゲーテ","ドイツの詩人、小説家、劇作家 / 1749～1832"]
[{"$f":"IFERROR(FIND(作業!$B$5,名言集!C3),IFERROR(FIND(作業!$B$5,名言集!D3),\"\"))","v":1},{"$f":"IF(A3=\"\",B2,B2+1)","v":3},"どんなに悔いても過去は変わらない。どれほど心配したところで未来もどうなるものでもない。いま、現在に最善を尽くすことである。","松下幸之助","日本の実業家、発明家、パナソニック創業者 / 1894～1989"]
[{"$f":"IFERROR(FIND(作業!$B$5,名言集!C4),IFERROR(FIND(作業!$B$5,名言集!D4),\"\"))","v":1},4,"最も重要な決定とは、何をするかではなく、何をしないかを決めることだ。","スティーブ・ジョブズ","米国の実業家、アップル創業者 / 1955～2011"]
[{"$f":"IFERROR(FIND(作業!$B$5,名言集!C5),IFERROR(FIND(作業!$B$5,名言集!D5),\"\"))","v":1},5,"人生は楽ではない。そこが面白い。","武者小路実篤","日本の小説家、詩人、劇作家、画家 / 1885～1976"]
[{"$f":"IFERROR(FIND(作業!$B$5,名言集!C6),IFERROR(FIND(作業!$B$5,名言集!D6),\"\"))","v":1},6,"自分で自分をあきらめなければ、人生に「負け」はない。","斎藤茂太","日本の精神科医、随筆家 / 1916～2006"]
[{"$f":"IFERROR(FIND(作業!$B$5,名言集!C7),IFERROR(FIND(作業!$B$5,名言集!D7),\"\"))","v":1},7,"数えきれないほど、悔しい思いをしてきたけれどその度にお袋の「我慢しなさい」って言葉を思い浮かべて、なんとか笑ってきたんです。","手塚治虫","日本の漫画家、アニメーター、医学博士 / 1928～1989"]
[{"$f":"IFERROR(FIND(作業!$B$5,名言集!C8),IFERROR(FIND(作業!$B$5,名言集!D8),\"\"))","v":1},8,"人生は公平ではない。そのことに慣れよう。","ビル・ゲイツ","米国の実業家、マイクロソフト社の創業者 / 1955～"]
[{"$f":"IFERROR(FIND(作業!$B$5,名言集!C9),IFERROR(FIND(作業!$B$5,名言集!D9),\"\"))","v":1},9,"親切にしなさい。あなたが会う人はみんな、厳しい闘いをしているのだから。","プラトン","古代ギリシアの哲学者 / 紀元前427～前347"]
[{"$f":"IFERROR(FIND(作業!$B$5,名言集!C10),IFERROR(FIND(作業!$B$5,名言集!D10),\"\"))","v":1},10,"善人はこの世で多くの害をなす。彼らがなす最大の害は、人びとを善人と悪人に分けてしまうことだ。","オスカー・ワイルド","アイルランドの詩人、作家、劇作家 / 1854～1900"]
[{"$f":"IFERROR(FIND(作業!$B$5,名言集!C11),IFERROR(FIND(作業!$B$5,名言集!D11),\"\"))","v":1},11,"過ちを改めるには、自分が間違いを犯したと自覚すれば、それでよい。そのことをさっぱり思いすてて、ただちに一歩を踏み出すことが大事である。","西郷隆盛","幕末の薩摩藩士、維新の三傑の一人 / 1828～1877"]
[{"$f":"IFERROR(FIND(作業!$B$5,名言集!C12),IFERROR(FIND(作業!$B$5,名言集!D12),\"\"))","v":1},12,"今日一日、怒らず、恐れず、悲しまず、正直、親切、愉快に生きよ。","中村天風","日本初のヨーガ行者、天風会の創始者 / 1876～1968"]
[{"$f":"IFERROR(FIND(作業!$B$5,名言集!C13),IFERROR(FIND(作業!$B$5,名言集!D13),\"\"))","v":1},13,"心の底からやりたいと思わないなら、やめておけ。","ヘミングウェイ","米国の小説家、ノーベル文学賞受賞 / 1899～1961"]
[{"$f":"IFERROR(FIND(作業!$B$5,名言集!C14),IFERROR(FIND(作業!$B$5,名言集!D14),\"\"))","v":1},14,"何であれ、怒りから始まったものは、恥にまみれて終わる。","ベンジャミン・フランクリン","米国の政治家、外交官、物理学者 / 1706～1790"]
[{"$f":"IFERROR(FIND(作業!$B$5,名言集!C15),IFERROR(FIND(作業!$B$5,名言集!D15),\"\"))","v":1},15,"自分で薪を割れ、二重に温まる。","ヘンリー・フォード","米国のフォード・モーター創業者 / 1863～1947"]
[{"$f":"IFERROR(FIND(作業!$B$5,名言集!C16),IFERROR(FIND(作業!$B$5,名言集!D16),\"\"))","v":1},16,"人生とは、人生以外のことを夢中で考えているときにあるんだよ。","ジョン・レノン","英国のミュージシャン、ビートルズのリーダー / 1940～1980"]
[{"$f":"IFERROR(FIND(作業!$B$5,名言集!C17),IFERROR(FIND(作業!$B$5,名言集!D17),\"\"))","v":1},17,"一日一字を記さば一年にして三百六十字を得、一夜一時を怠らば、百歳の間三万六千時を失う。","吉田松陰","幕末の長州藩士、明治維新の精神的指導者 / 1830～1859"]
[{"$f":"IFERROR(FIND(作業!$B$5,名言集!C18),IFERROR(FIND(作業!$B$5,名言集!D18),\"\"))","v":1},18,"自分の価値は自分で決めることさ。つらくて貧乏でも自分で自分を殺すことだけはしちゃいけねぇよ。","勝海舟","幕末の武士（幕臣、政治家 / 1823～1899"]
[{"$f":"IFERROR(FIND(作業!$B$5,名言集!C19),IFERROR(FIND(作業!$B$5,名言集!D19),\"\"))","v":1},19,"一人前になるには50年はかかるんだ。功を焦るな。悲観するな。もっと根を深く張るんだ。根を深く張れ。","升田幸三","日本の将棋棋士、実力制第四代名人 / 1918～1991"]
[{"$f":"IFERROR(FIND(作業!$B$5,名言集!C20),IFERROR(FIND(作業!$B$5,名言集!D20),\"\"))","v":1},20,"我、神仏を尊びて、神仏を頼らず。","宮本武蔵","江戸時代初期の剣術家、兵法家 / 1584～1645"]
[{"$f":"IFERROR(FIND(作業!$B$5,名言集!C21),IFERROR(FIND(作業!$B$5,名言集!D21),\"\"))","v":1},21,"人は負けることを知りて、人より勝れり。","徳川家康","戦国時代の武将、江戸幕府の初代征夷大将軍 / 1543～1616"]
[{"$f":"IFERROR(FIND(作業!$B$5,名言集!C22),IFERROR(FIND(作業!$B$5,名言集!D22),\"\"))","v":1},22,"努力は必ず報われる。もし報われない努力があるのならば、それはまだ努力と呼べない。","王貞治","日本の元プロ野球選手、監督 / 1940～"]
[{"$f":"IFERROR(FIND(作業!$B$5,名言集!C23),IFERROR(FIND(作業!$B$5,名言集!D23),\"\"))","v":1},23,"日本人は、失敗ということを恐れすぎるようである。どだい、失敗を恐れて何もしないなんて人間は、最低なのである。","本田宗一郎","日本の実業家、技術者、ホンダの創業者 / 1906～1991"]
[{"$f":"IFERROR(FIND(作業!$B$5,名言集!C24),IFERROR(FIND(作業!$B$5,名言集!D24),\"\"))","v":1},24,"愛はお互いを見つめ合うことではなく、ともに同じ方向を見つめることである。","サン＝テグジュペリ","フランスの作家、操縦士 / 1900～1944"]
[{"$f":"IFERROR(FIND(作業!$B$5,名言集!C25),IFERROR(FIND(作業!$B$5,名言集!D25),\"\"))","v":1},25,"独立の気力なき者は必ず人に依頼す、人に依頼する者は必ず人を恐る、人を恐るる者は必ず人にへつらうものなり。","福沢諭吉","幕末から明治初期の中津藩士、啓蒙思想家、教育者 / 1835～1901"]
[{"$f":"IFERROR(FIND(作業!$B$5,名言集!C26),IFERROR(FIND(作業!$B$5,名言集!D26),\"\"))","v":1},26,"微笑めば友達ができる。しかめっ面をすればしわができる。","ジョージ・エリオット","英国の女性作家 / 1819～1880"]
[{"$f":"IFERROR(FIND(作業!$B$5,名言集!C27),IFERROR(FIND(作業!$B$5,名言集!D27),\"\"))","v":1},27,"他人を押さえつけている限り、自分もそこから動くことはできない。","ジョージ・ワシントン","米国の軍人、政治家、米国初代大統領 / 1732～1799"]
[{"$f":"IFERROR(FIND(作業!$B$5,名言集!C28),IFERROR(FIND(作業!$B$5,名言集!D28),\"\"))","v":1},28,"結婚してようがしてまいが、あなたが幸せならそれが幸せなのよ。","グレタ・ガルボ","スウェーデン出身のハリウッド女優 / 1905～1990"]
[{"$f":"IFERROR(FIND(作業!$B$5,名言集!C29),IFERROR(FIND(作業!$B$5,名言集!D29),\"\"))","v":1},29,"あなたの運命が形作られるのは、あなたが決断する瞬間なのです。","アンソニー・ロビンズ","米国の自己啓発書作家、講演家 / 1960～"]
[{"$f":"IFERROR(FIND(作業!$B$5,名言集!C30),IFERROR(FIND(作業!$B$5,名言集!D30),\"\"))","v":1},30,"雲の向こうは、いつも青空。","ルイーザ・メイ・オルコット","米国の女性小説家 / 1832～1888"]
[{"$f":"IFERROR(FIND(作業!$B$5,名言集!C31),IFERROR(FIND(作業!$B$5,名言集!D31),\"\"))","v":1},31,"誰かのことを批判したくなったときには、世間のすべての人がおまえのように恵まれているわけではないということをちょっと思いだしてみるのだ。","スコット・フィッツジェラルド","米国の小説家 / 1896～1940"]
[{"$f":"IFERROR(FIND(作業!$B$5,名言集!C32),IFERROR(FIND(作業!$B$5,名言集!D32),\"\"))","v":1},32,"タフでなければ生きて行けない。優しくなれなければ生きている資格がない。","レイモンド・チャンドラー","米国のハードボイルド作家 / 1888～1959"]
[{"$f":"IFERROR(FIND(作業!$B$5,名言集!C33),IFERROR(FIND(作業!$B$5,名言集!D33),\"\"))","v":1},33,"つらい道を避けないこと。自分の目指す場所にたどりつくためには進まなければ。","キャサリン・アン・ポーター","米国の小説家 / 1890～1980"]
[{"$f":"IFERROR(FIND(作業!$B$5,名言集!C34),IFERROR(FIND(作業!$B$5,名言集!D34),\"\"))","v":1},34,"女は、人生で一度や二度は、ワルい男を愛してしまうの。でもだからこそ、イイ男に出会ったとき、感謝する気持ちになれるのよ。","マージョリー・キナン・ローリングス","米国の小説家『子鹿物語』著者 / 1896～1953"]
[{"$f":"IFERROR(FIND(作業!$B$5,名言集!C35),IFERROR(FIND(作業!$B$5,名言集!D35),\"\"))","v":1},35,"自分ならできると思う。あるいは自分にはできないと思う。どちらも正しいの。","メアリー・ケイ・アッシュ","米国の化粧品会社創業者 / 1918～2001"]
[{"$f":"IFERROR(FIND(作業!$B$5,名言集!C36),IFERROR(FIND(作業!$B$5,名言集!D36),\"\"))","v":1},36,"問いを投げる年もあれば、答える年もある。","ゾラ・ニール・ハーストン","米国の黒人女性作家 / 1891～1960"]
[{"$f":"IFERROR(FIND(作業!$B$5,名言集!C37),IFERROR(FIND(作業!$B$5,名言集!D37),\"\"))","v":1},37,"人の価値とは、その人が得たものではなく、その人が与えたもので測られる。","アインシュタイン","理論物理学者、ノーベル物理学賞受賞 / 1879～1955"]
[{"$f":"IFERROR(FIND(作業!$B$5,名言集!C38),IFERROR(FIND(作業!$B$5,名言集!D38),\"\"))","v":1},38,"神様は私たちに、成功してほしいなんて思っていません。ただ、挑戦することを望んでいるだけよ。","マザー・テレサ","カトリック修道女、ノーベル平和賞受賞 / 1910～1997"]
[{"$f":"IFERROR(FIND(作業!$B$5,名言集!C39),IFERROR(FIND(作業!$B$5,名言集!D39),\"\"))","v":1},39,"あなたがやれる最善を尽くしたなら、心配したって事態は良くならない。私もいろいろなことを心配するが、ダムからあふれる水までは心配しない。","ウォルト・ディズニー","米国のエンターテイナー、実業家 / 1901～1966"]
[{"$f":"IFERROR(FIND(作業!$B$5,名言集!C40),IFERROR(FIND(作業!$B$5,名言集!D40),\"\"))","v":1},40,"人生とは自分を見つけることではない。人生とは自分を創ることである。","バーナード・ショー","アイルランドの劇作家、ノーベル文学賞受賞 / 1856～1950"]
{"$rows_left_out":982}